FailedConsole Output

Started by an SCM change
Started by upstream project "stats" build number 11
Building remotely on i-321eb34a in workspace /media/ephemeral0/workspace/trees
$ hg clone --rev default --noupdate ssh://jenkins@dev.davidsoergel.com//home/hg/trees /media/ephemeral0/workspace/trees
adding changesets
adding manifests
adding file changes
added 49 changesets with 149 changes to 61 files
[trees] $ hg update --rev default
61 files updated, 0 files merged, 0 files removed, 0 files unresolved
[trees] $ hg log --rev . --template {node}
[trees] $ hg log --rev . --template {rev}
[trees] $ hg log --rev 3a729395e3b1e2a07237cb9eab27388832ed66c0
[trees] $ hg log --template "<changeset node='{node}' author='{author|xmlescape}' rev='{rev}' date='{date}'><msg>{desc|xmlescape}</msg><added>{file_adds|stringify|xmlescape}</added><deleted>{file_dels|stringify|xmlescape}</deleted><files>{files|stringify|xmlescape}</files><parents>{parents}</parents></changeset>\n" --rev default:0 --follow --prune 3a729395e3b1e2a07237cb9eab27388832ed66c0
 your Apache Maven build is setup to use a config with id org.jenkinsci.plugins.configfiles.maven.MavenSettingsConfig1337980147845 but cannot find the config
Parsing POMs
Modules changed, recalculating dependency graph
[trees] $ /usr/java/default/bin/java -Xmx1024M -XX:MaxPermSize=256M -cp /media/ephemeral0/maven3-agent.jar:/media/ephemeral0/tools/Maven/Maven_3.0.4/boot/plexus-classworlds-2.4.jar org.jvnet.hudson.maven3.agent.Maven3Main /media/ephemeral0/tools/Maven/Maven_3.0.4 /tmp/slave.jar /media/ephemeral0/maven3-interceptor.jar 58704
<===[JENKINS REMOTING CAPACITY]===>channel started
log4j:WARN No appenders could be found for logger (org.apache.commons.beanutils.converters.BooleanConverter).
log4j:WARN Please initialize the log4j system properly.
Executing Maven:  -B -f /media/ephemeral0/workspace/trees/pom.xml -U -e clean source:jar package jar:test-jar
[INFO] Error stacktraces are turned on.
[INFO] Scanning for projects...
Projects to build: [MavenProject: com.davidsoergel:trees:1.023-SNAPSHOT @ /media/ephemeral0/workspace/trees/pom.xml]
Downloading: http://repo.maven.apache.org/maven2/org/codehaus/mojo/maven-metadata.xml
Downloading: http://dev.davidsoergel.com/nexus/content/groups/public/org/apache/maven/plugins/maven-metadata.xml
Downloading: http://dev.davidsoergel.com/nexus/content/groups/public/org/codehaus/mojo/maven-metadata.xml
Downloading: http://repo.maven.apache.org/maven2/org/apache/maven/plugins/maven-metadata.xml
Downloaded: http://repo.maven.apache.org/maven2/org/apache/maven/plugins/maven-metadata.xml (11 KB at 7.5 KB/sec)
Downloaded: http://repo.maven.apache.org/maven2/org/codehaus/mojo/maven-metadata.xml (21 KB at 11.4 KB/sec)
Downloaded: http://dev.davidsoergel.com/nexus/content/groups/public/org/apache/maven/plugins/maven-metadata.xml (11 KB at 1.4 KB/sec)
Downloaded: http://dev.davidsoergel.com/nexus/content/groups/public/org/codehaus/mojo/maven-metadata.xml (21 KB at 2.7 KB/sec)
Downloading: http://repo.maven.apache.org/maven2/org/apache/maven/plugins/maven-source-plugin/maven-metadata.xml
Downloading: http://dev.davidsoergel.com/nexus/content/groups/public/org/apache/maven/plugins/maven-source-plugin/maven-metadata.xml
Downloaded: http://repo.maven.apache.org/maven2/org/apache/maven/plugins/maven-source-plugin/maven-metadata.xml (632 B at 4.8 KB/sec)
Downloaded: http://dev.davidsoergel.com/nexus/content/groups/public/org/apache/maven/plugins/maven-source-plugin/maven-metadata.xml (632 B at 0.8 KB/sec)
projectStarted com.davidsoergel:trees:1.023-SNAPSHOT
[INFO]                                                                         
[INFO] ------------------------------------------------------------------------
[INFO] Building trees 1.023-SNAPSHOT
[INFO] ------------------------------------------------------------------------
Downloading: http://dev.davidsoergel.com/nexus/content/groups/public/com/davidsoergel/dsutils/1.05/dsutils-1.05.pom
Downloaded: http://dev.davidsoergel.com/nexus/content/groups/public/com/davidsoergel/dsutils/1.05/dsutils-1.05.pom (5 KB at 5.9 KB/sec)
Downloading: http://dev.davidsoergel.com/nexus/content/groups/public/com/davidsoergel/stats/0.94/stats-0.94.pom
Downloading: http://repo.maven.apache.org/maven2/com/davidsoergel/stats/0.94/stats-0.94.pom
[WARNING] The POM for com.davidsoergel:stats:jar:0.94 is missing, no dependency information available
Downloading: http://dev.davidsoergel.com/nexus/content/groups/public/com/davidsoergel/dsutils/1.05/dsutils-1.05.jar
Downloading: http://dev.davidsoergel.com/nexus/content/groups/public/com/davidsoergel/dsutils/1.05/dsutils-1.05-tests.jar
Downloading: http://dev.davidsoergel.com/nexus/content/groups/public/com/davidsoergel/stats/0.94/stats-0.94.jar
Downloaded: http://dev.davidsoergel.com/nexus/content/groups/public/com/davidsoergel/dsutils/1.05/dsutils-1.05-tests.jar (96 KB at 124.2 KB/sec)
Downloaded: http://dev.davidsoergel.com/nexus/content/groups/public/com/davidsoergel/dsutils/1.05/dsutils-1.05.jar (302 KB at 330.3 KB/sec)
Downloading: http://repo.maven.apache.org/maven2/com/davidsoergel/stats/0.94/stats-0.94.jar
projectFailed com.davidsoergel:trees:1.023-SNAPSHOT
sessionEnded
[INFO] ------------------------------------------------------------------------
[INFO] BUILD FAILURE
[INFO] ------------------------------------------------------------------------
[INFO] Total time: 27.220s
[INFO] Finished at: Sat Jul 07 17:05:36 UTC 2012
[INFO] Final Memory: 9M/25M
[INFO] ------------------------------------------------------------------------
Projects to build: [MavenProject: com.davidsoergel:trees:1.023-SNAPSHOT @ /media/ephemeral0/workspace/trees/pom.xml]
[JENKINS] Archiving /media/ephemeral0/workspace/trees/pom.xml to /usr/share/apache-tomcat-7.0.22/.jenkins/jobs/trees/modules/com.davidsoergel$trees/builds/2012-07-07_13-04-24/archive/com.davidsoergel/trees/1.023-SNAPSHOT/trees-1.023-SNAPSHOT.pom
Waiting for Jenkins to finish collecting data
mavenExecutionResult exceptions not empty
message : Failed to execute goal on project trees: Could not resolve dependencies for project com.davidsoergel:trees:jar:1.023-SNAPSHOT: Could not find artifact com.davidsoergel:stats:jar:0.94 in dev.davidsoergel.com (http://dev.davidsoergel.com/nexus/content/groups/public)
cause : Could not resolve dependencies for project com.davidsoergel:trees:jar:1.023-SNAPSHOT: Could not find artifact com.davidsoergel:stats:jar:0.94 in dev.davidsoergel.com (http://dev.davidsoergel.com/nexus/content/groups/public)
Stack trace : 
org.apache.maven.lifecycle.LifecycleExecutionException: Failed to execute goal on project trees: Could not resolve dependencies for project com.davidsoergel:trees:jar:1.023-SNAPSHOT: Could not find artifact com.davidsoergel:stats:jar:0.94 in dev.davidsoergel.com (http://dev.davidsoergel.com/nexus/content/groups/public)
	at org.apache.maven.lifecycle.internal.LifecycleDependencyResolver.getDependencies(LifecycleDependencyResolver.java:210)
	at org.apache.maven.lifecycle.internal.LifecycleDependencyResolver.resolveProjectDependencies(LifecycleDependencyResolver.java:117)
	at org.apache.maven.lifecycle.internal.MojoExecutor.ensureDependenciesAreResolved(MojoExecutor.java:258)
	at org.apache.maven.lifecycle.internal.MojoExecutor.execute(MojoExecutor.java:201)
	at org.apache.maven.lifecycle.internal.MojoExecutor.execute(MojoExecutor.java:153)
	at org.apache.maven.lifecycle.internal.MojoExecutor.execute(MojoExecutor.java:145)
	at org.apache.maven.lifecycle.internal.LifecycleModuleBuilder.buildProject(LifecycleModuleBuilder.java:84)
	at org.apache.maven.lifecycle.internal.LifecycleModuleBuilder.buildProject(LifecycleModuleBuilder.java:59)
	at org.apache.maven.lifecycle.internal.LifecycleStarter.singleThreadedBuild(LifecycleStarter.java:183)
	at org.apache.maven.lifecycle.internal.LifecycleStarter.execute(LifecycleStarter.java:161)
	at org.apache.maven.DefaultMaven.doExecute(DefaultMaven.java:320)
	at org.apache.maven.DefaultMaven.execute(DefaultMaven.java:156)
	at org.jvnet.hudson.maven3.launcher.Maven3Launcher.main(Maven3Launcher.java:79)
	at sun.reflect.NativeMethodAccessorImpl.invoke0(Native Method)
	at sun.reflect.NativeMethodAccessorImpl.invoke(NativeMethodAccessorImpl.java:57)
	at sun.reflect.DelegatingMethodAccessorImpl.invoke(DelegatingMethodAccessorImpl.java:43)
	at java.lang.reflect.Method.invoke(Method.java:601)
	at org.codehaus.plexus.classworlds.launcher.Launcher.launchStandard(Launcher.java:329)
	at org.codehaus.plexus.classworlds.launcher.Launcher.launch(Launcher.java:239)
	at org.jvnet.hudson.maven3.agent.Maven3Main.launch(Maven3Main.java:158)
	at hudson.maven.Maven3Builder.call(Maven3Builder.java:98)
	at hudson.maven.Maven3Builder.call(Maven3Builder.java:64)
	at hudson.remoting.UserRequest.perform(UserRequest.java:118)
	at hudson.remoting.UserRequest.perform(UserRequest.java:48)
	at hudson.remoting.Request$2.run(Request.java:326)
	at hudson.remoting.InterceptingExecutorService$1.call(InterceptingExecutorService.java:72)
	at java.util.concurrent.FutureTask$Sync.innerRun(FutureTask.java:334)
	at java.util.concurrent.FutureTask.run(FutureTask.java:166)
	at java.util.concurrent.ThreadPoolExecutor.runWorker(ThreadPoolExecutor.java:1110)
	at java.util.concurrent.ThreadPoolExecutor$Worker.run(ThreadPoolExecutor.java:603)
	at java.lang.Thread.run(Thread.java:722)
Caused by: org.apache.maven.project.DependencyResolutionException: Could not resolve dependencies for project com.davidsoergel:trees:jar:1.023-SNAPSHOT: Could not find artifact com.davidsoergel:stats:jar:0.94 in dev.davidsoergel.com (http://dev.davidsoergel.com/nexus/content/groups/public)
	at org.apache.maven.project.DefaultProjectDependenciesResolver.resolve(DefaultProjectDependenciesResolver.java:189)
	at org.apache.maven.lifecycle.internal.LifecycleDependencyResolver.getDependencies(LifecycleDependencyResolver.java:185)
	... 30 more
Caused by: org.sonatype.aether.resolution.DependencyResolutionException: Could not find artifact com.davidsoergel:stats:jar:0.94 in dev.davidsoergel.com (http://dev.davidsoergel.com/nexus/content/groups/public)
	at org.sonatype.aether.impl.internal.DefaultRepositorySystem.resolveDependencies(DefaultRepositorySystem.java:375)
	at org.apache.maven.project.DefaultProjectDependenciesResolver.resolve(DefaultProjectDependenciesResolver.java:183)
	... 31 more
Caused by: org.sonatype.aether.resolution.ArtifactResolutionException: Could not find artifact com.davidsoergel:stats:jar:0.94 in dev.davidsoergel.com (http://dev.davidsoergel.com/nexus/content/groups/public)
	at org.sonatype.aether.impl.internal.DefaultArtifactResolver.resolve(DefaultArtifactResolver.java:538)
	at org.sonatype.aether.impl.internal.DefaultArtifactResolver.resolveArtifacts(DefaultArtifactResolver.java:216)
	at org.sonatype.aether.impl.internal.DefaultRepositorySystem.resolveDependencies(DefaultRepositorySystem.java:358)
	... 32 more
Caused by: org.sonatype.aether.transfer.ArtifactNotFoundException: Could not find artifact com.davidsoergel:stats:jar:0.94 in dev.davidsoergel.com (http://dev.davidsoergel.com/nexus/content/groups/public)
	at org.sonatype.aether.connector.wagon.WagonRepositoryConnector$4.wrap(WagonRepositoryConnector.java:947)
	at org.sonatype.aether.connector.wagon.WagonRepositoryConnector$4.wrap(WagonRepositoryConnector.java:941)
	at org.sonatype.aether.connector.wagon.WagonRepositoryConnector$GetTask.run(WagonRepositoryConnector.java:669)
	at org.sonatype.aether.util.concurrency.RunnableErrorForwarder$1.run(RunnableErrorForwarder.java:60)
	... 3 more
channel stopped
Sending e-mails to: dev@davidsoergel.com
Finished: FAILURE