FailedConsole Output

Started by an SCM change
Building remotely on i-aefcc9c0 in workspace /media/ephemeral0/workspace/sequtils
$ hg clone --rev default --noupdate ssh://jenkins@dev.davidsoergel.com//home/hg/sequtils /media/ephemeral0/workspace/sequtils
adding changesets
adding manifests
adding file changes
added 225 changesets with 406 changes to 92 files
[sequtils] $ hg update --rev default
86 files updated, 0 files merged, 0 files removed, 0 files unresolved
[sequtils] $ hg log --rev . --template {node}
[sequtils] $ hg log --rev . --template {rev}
[sequtils] $ hg log --rev 00d913c1b3a7d9c07b11525fbf0ab396d9253675
[sequtils] $ hg log --template "<changeset node='{node}' author='{author|xmlescape}' rev='{rev}' date='{date}'><msg>{desc|xmlescape}</msg><added>{file_adds|stringify|xmlescape}</added><deleted>{file_dels|stringify|xmlescape}</deleted><files>{files|stringify|xmlescape}</files><parents>{parents}</parents></changeset>\n" --rev default:0 --follow --prune 00d913c1b3a7d9c07b11525fbf0ab396d9253675
Parsing POMs
Modules changed, recalculating dependency graph
[sequtils] $ java -Xmx1024M -XX:MaxPermSize=256M -cp /media/ephemeral0/maven3-agent.jar:/media/ephemeral0/tools/hudson.tasks.Maven_MavenInstallation/Maven_3.0.4/boot/plexus-classworlds-2.4.jar org.jvnet.hudson.maven3.agent.Maven3Main /media/ephemeral0/tools/hudson.tasks.Maven_MavenInstallation/Maven_3.0.4 /tmp/slave.jar /media/ephemeral0/maven3-interceptor.jar 57398
<===[JENKINS REMOTING CAPACITY]===>channel started
log4j:WARN No appenders could be found for logger (org.apache.commons.beanutils.converters.BooleanConverter).
log4j:WARN Please initialize the log4j system properly.
Executing Maven:  -B -f /media/ephemeral0/workspace/sequtils/pom.xml -U -e clean source:jar package jar:test-jar
[INFO] Error stacktraces are turned on.
[INFO] Scanning for projects...
Downloading: http://dev.davidsoergel.com/nexus/content/groups/public/org/apache/maven/plugins/maven-metadata.xml
Downloading: http://dev.davidsoergel.com/nexus/content/groups/public/org/codehaus/mojo/maven-metadata.xml
Downloading: http://repo.maven.apache.org/maven2/org/apache/maven/plugins/maven-metadata.xml
Downloading: http://repo.maven.apache.org/maven2/org/codehaus/mojo/maven-metadata.xml
Downloaded: http://repo.maven.apache.org/maven2/org/apache/maven/plugins/maven-metadata.xml (11 KB at 11.9 KB/sec)
Downloaded: http://dev.davidsoergel.com/nexus/content/groups/public/org/apache/maven/plugins/maven-metadata.xml (11 KB at 11.9 KB/sec)
Downloaded: http://dev.davidsoergel.com/nexus/content/groups/public/org/codehaus/mojo/maven-metadata.xml (22 KB at 23.1 KB/sec)
Downloaded: http://repo.maven.apache.org/maven2/org/codehaus/mojo/maven-metadata.xml (22 KB at 20.1 KB/sec)
Downloading: http://dev.davidsoergel.com/nexus/content/groups/public/org/apache/maven/plugins/maven-source-plugin/maven-metadata.xml
Downloading: http://repo.maven.apache.org/maven2/org/apache/maven/plugins/maven-source-plugin/maven-metadata.xml
Downloaded: http://repo.maven.apache.org/maven2/org/apache/maven/plugins/maven-source-plugin/maven-metadata.xml (692 B at 5.8 KB/sec)
Downloaded: http://dev.davidsoergel.com/nexus/content/groups/public/org/apache/maven/plugins/maven-source-plugin/maven-metadata.xml (692 B at 5.0 KB/sec)
[INFO]                                                                         
[INFO] ------------------------------------------------------------------------
[INFO] Building sequtils 0.92-SNAPSHOT
[INFO] ------------------------------------------------------------------------
Downloading: http://dev.davidsoergel.com/nexus/content/groups/public/edu/berkeley/compbio/ml/0.921/ml-0.921.pom
Downloading: http://repo.maven.apache.org/maven2/edu/berkeley/compbio/ml/0.921/ml-0.921.pom
[WARNING] The POM for edu.berkeley.compbio:ml:jar:0.921 is missing, no dependency information available
Downloading: http://dev.davidsoergel.com/nexus/content/groups/public/org/easymock/easymock/3.1/easymock-3.1.pom
Downloaded: http://dev.davidsoergel.com/nexus/content/groups/public/org/easymock/easymock/3.1/easymock-3.1.pom (6 KB at 36.9 KB/sec)
Downloading: http://dev.davidsoergel.com/nexus/content/groups/public/org/easymock/easymock-parent/3.1/easymock-parent-3.1.pom
Downloaded: http://dev.davidsoergel.com/nexus/content/groups/public/org/easymock/easymock-parent/3.1/easymock-parent-3.1.pom (13 KB at 80.3 KB/sec)
Downloading: http://dev.davidsoergel.com/nexus/content/groups/public/cglib/cglib-nodep/2.2.2/cglib-nodep-2.2.2.pom
Downloaded: http://dev.davidsoergel.com/nexus/content/groups/public/cglib/cglib-nodep/2.2.2/cglib-nodep-2.2.2.pom (2 KB at 9.0 KB/sec)
Downloading: http://dev.davidsoergel.com/nexus/content/groups/public/org/objenesis/objenesis/1.2/objenesis-1.2.pom
Downloaded: http://dev.davidsoergel.com/nexus/content/groups/public/org/objenesis/objenesis/1.2/objenesis-1.2.pom (3 KB at 10.0 KB/sec)
Downloading: http://dev.davidsoergel.com/nexus/content/groups/public/org/objenesis/objenesis-parent/1.2/objenesis-parent-1.2.pom
Downloaded: http://dev.davidsoergel.com/nexus/content/groups/public/org/objenesis/objenesis-parent/1.2/objenesis-parent-1.2.pom (11 KB at 72.7 KB/sec)
Downloading: http://dev.davidsoergel.com/nexus/content/groups/public/edu/berkeley/compbio/ml/0.921/ml-0.921.jar
Downloading: http://dev.davidsoergel.com/nexus/content/groups/public/cglib/cglib-nodep/2.2.2/cglib-nodep-2.2.2.jar
Downloading: http://dev.davidsoergel.com/nexus/content/groups/public/org/easymock/easymock/3.1/easymock-3.1.jar
Downloading: http://dev.davidsoergel.com/nexus/content/groups/public/org/objenesis/objenesis/1.2/objenesis-1.2.jar
Downloaded: http://dev.davidsoergel.com/nexus/content/groups/public/org/objenesis/objenesis/1.2/objenesis-1.2.jar (36 KB at 43.9 KB/sec)
Downloaded: http://dev.davidsoergel.com/nexus/content/groups/public/cglib/cglib-nodep/2.2.2/cglib-nodep-2.2.2.jar (320 KB at 389.8 KB/sec)
Downloaded: http://dev.davidsoergel.com/nexus/content/groups/public/org/easymock/easymock/3.1/easymock-3.1.jar (110 KB at 128.0 KB/sec)
Downloading: http://repo.maven.apache.org/maven2/edu/berkeley/compbio/ml/0.921/ml-0.921.jar
[INFO] ------------------------------------------------------------------------
[INFO] BUILD FAILURE
[INFO] ------------------------------------------------------------------------
[INFO] Total time: 29.298s
[INFO] Finished at: Thu Mar 21 01:16:08 UTC 2013
[INFO] Final Memory: 7M/25M
[INFO] ------------------------------------------------------------------------
[JENKINS] Archiving /media/ephemeral0/workspace/sequtils/pom.xml to /usr/share/apache-tomcat-7.0.22/.jenkins/jobs/sequtils/modules/edu.berkeley.compbio$sequtils/builds/2013-03-20_21-15-25/archive/edu.berkeley.compbio/sequtils/0.92-SNAPSHOT/sequtils-0.92-SNAPSHOT.pom
Waiting for Jenkins to finish collecting data
mavenExecutionResult exceptions not empty
message : Failed to execute goal on project sequtils: Could not resolve dependencies for project edu.berkeley.compbio:sequtils:jar:0.92-SNAPSHOT: Could not find artifact edu.berkeley.compbio:ml:jar:0.921 in dev.davidsoergel.com (http://dev.davidsoergel.com/nexus/content/groups/public)
cause : Could not resolve dependencies for project edu.berkeley.compbio:sequtils:jar:0.92-SNAPSHOT: Could not find artifact edu.berkeley.compbio:ml:jar:0.921 in dev.davidsoergel.com (http://dev.davidsoergel.com/nexus/content/groups/public)
Stack trace : 
org.apache.maven.lifecycle.LifecycleExecutionException: Failed to execute goal on project sequtils: Could not resolve dependencies for project edu.berkeley.compbio:sequtils:jar:0.92-SNAPSHOT: Could not find artifact edu.berkeley.compbio:ml:jar:0.921 in dev.davidsoergel.com (http://dev.davidsoergel.com/nexus/content/groups/public)
	at org.apache.maven.lifecycle.internal.LifecycleDependencyResolver.getDependencies(LifecycleDependencyResolver.java:210)
	at org.apache.maven.lifecycle.internal.LifecycleDependencyResolver.resolveProjectDependencies(LifecycleDependencyResolver.java:117)
	at org.apache.maven.lifecycle.internal.MojoExecutor.ensureDependenciesAreResolved(MojoExecutor.java:258)
	at org.apache.maven.lifecycle.internal.MojoExecutor.execute(MojoExecutor.java:201)
	at org.apache.maven.lifecycle.internal.MojoExecutor.execute(MojoExecutor.java:153)
	at org.apache.maven.lifecycle.internal.MojoExecutor.execute(MojoExecutor.java:145)
	at org.apache.maven.lifecycle.internal.LifecycleModuleBuilder.buildProject(LifecycleModuleBuilder.java:84)
	at org.apache.maven.lifecycle.internal.LifecycleModuleBuilder.buildProject(LifecycleModuleBuilder.java:59)
	at org.apache.maven.lifecycle.internal.LifecycleStarter.singleThreadedBuild(LifecycleStarter.java:183)
	at org.apache.maven.lifecycle.internal.LifecycleStarter.execute(LifecycleStarter.java:161)
	at org.apache.maven.DefaultMaven.doExecute(DefaultMaven.java:320)
	at org.apache.maven.DefaultMaven.execute(DefaultMaven.java:156)
	at org.jvnet.hudson.maven3.launcher.Maven3Launcher.main(Maven3Launcher.java:79)
	at sun.reflect.NativeMethodAccessorImpl.invoke0(Native Method)
	at sun.reflect.NativeMethodAccessorImpl.invoke(NativeMethodAccessorImpl.java:39)
	at sun.reflect.DelegatingMethodAccessorImpl.invoke(DelegatingMethodAccessorImpl.java:25)
	at java.lang.reflect.Method.invoke(Method.java:597)
	at org.codehaus.plexus.classworlds.launcher.Launcher.launchStandard(Launcher.java:329)
	at org.codehaus.plexus.classworlds.launcher.Launcher.launch(Launcher.java:239)
	at org.jvnet.hudson.maven3.agent.Maven3Main.launch(Maven3Main.java:158)
	at hudson.maven.Maven3Builder.call(Maven3Builder.java:100)
	at hudson.maven.Maven3Builder.call(Maven3Builder.java:66)
	at hudson.remoting.UserRequest.perform(UserRequest.java:118)
	at hudson.remoting.UserRequest.perform(UserRequest.java:48)
	at hudson.remoting.Request$2.run(Request.java:326)
	at hudson.remoting.InterceptingExecutorService$1.call(InterceptingExecutorService.java:72)
	at java.util.concurrent.FutureTask$Sync.innerRun(FutureTask.java:303)
	at java.util.concurrent.FutureTask.run(FutureTask.java:138)
	at java.util.concurrent.ThreadPoolExecutor$Worker.runTask(ThreadPoolExecutor.java:886)
	at java.util.concurrent.ThreadPoolExecutor$Worker.run(ThreadPoolExecutor.java:908)
	at java.lang.Thread.run(Thread.java:662)
Caused by: org.apache.maven.project.DependencyResolutionException: Could not resolve dependencies for project edu.berkeley.compbio:sequtils:jar:0.92-SNAPSHOT: Could not find artifact edu.berkeley.compbio:ml:jar:0.921 in dev.davidsoergel.com (http://dev.davidsoergel.com/nexus/content/groups/public)
	at org.apache.maven.project.DefaultProjectDependenciesResolver.resolve(DefaultProjectDependenciesResolver.java:189)
	at org.apache.maven.lifecycle.internal.LifecycleDependencyResolver.getDependencies(LifecycleDependencyResolver.java:185)
	... 30 more
Caused by: org.sonatype.aether.resolution.DependencyResolutionException: Could not find artifact edu.berkeley.compbio:ml:jar:0.921 in dev.davidsoergel.com (http://dev.davidsoergel.com/nexus/content/groups/public)
	at org.sonatype.aether.impl.internal.DefaultRepositorySystem.resolveDependencies(DefaultRepositorySystem.java:375)
	at org.apache.maven.project.DefaultProjectDependenciesResolver.resolve(DefaultProjectDependenciesResolver.java:183)
	... 31 more
Caused by: org.sonatype.aether.resolution.ArtifactResolutionException: Could not find artifact edu.berkeley.compbio:ml:jar:0.921 in dev.davidsoergel.com (http://dev.davidsoergel.com/nexus/content/groups/public)
	at org.sonatype.aether.impl.internal.DefaultArtifactResolver.resolve(DefaultArtifactResolver.java:538)
	at org.sonatype.aether.impl.internal.DefaultArtifactResolver.resolveArtifacts(DefaultArtifactResolver.java:216)
	at org.sonatype.aether.impl.internal.DefaultRepositorySystem.resolveDependencies(DefaultRepositorySystem.java:358)
	... 32 more
Caused by: org.sonatype.aether.transfer.ArtifactNotFoundException: Could not find artifact edu.berkeley.compbio:ml:jar:0.921 in dev.davidsoergel.com (http://dev.davidsoergel.com/nexus/content/groups/public)
	at org.sonatype.aether.connector.wagon.WagonRepositoryConnector$4.wrap(WagonRepositoryConnector.java:947)
	at org.sonatype.aether.connector.wagon.WagonRepositoryConnector$4.wrap(WagonRepositoryConnector.java:941)
	at org.sonatype.aether.connector.wagon.WagonRepositoryConnector$GetTask.run(WagonRepositoryConnector.java:669)
	at org.sonatype.aether.util.concurrency.RunnableErrorForwarder$1.run(RunnableErrorForwarder.java:60)
	... 3 more
channel stopped
Sending e-mails to: dev@davidsoergel.com
Finished: FAILURE