FailedConsole Output

Started by an SCM change
Building remotely on i-1fe46072 in workspace /media/ephemeral0/workspace/sequtils
Unpacking http://archive.apache.org/dist/maven/binaries/apache-maven-3.0.4-bin.zip to /media/ephemeral0/tools/hudson.tasks.Maven_MavenInstallation/Maven_3.0.4 on i-1fe46072
$ hg clone --rev default --noupdate ssh://jenkins@dev.davidsoergel.com//home/hg/sequtils /media/ephemeral0/workspace/sequtils
adding changesets
adding manifests
adding file changes
added 223 changesets with 404 changes to 92 files
[sequtils] $ hg update --rev default
86 files updated, 0 files merged, 0 files removed, 0 files unresolved
[sequtils] $ hg log --rev . --template {node}
[sequtils] $ hg log --rev . --template {rev}
[sequtils] $ hg log --rev 7cfeb97f6487548ba21a28956765333ad0e35906
[sequtils] $ hg log --template "<changeset node='{node}' author='{author|xmlescape}' rev='{rev}' date='{date}'><msg>{desc|xmlescape}</msg><added>{file_adds|stringify|xmlescape}</added><deleted>{file_dels|stringify|xmlescape}</deleted><files>{files|stringify|xmlescape}</files><parents>{parents}</parents></changeset>\n" --rev default:0 --follow --prune 7cfeb97f6487548ba21a28956765333ad0e35906
Parsing POMs
Downloaded artifact http://dev.davidsoergel.com/nexus/content/groups/public//com/davidsoergel/basepom/1.01/basepom-1.01.pom
Modules changed, recalculating dependency graph
[sequtils] $ java -Xmx1024M -XX:MaxPermSize=256M -cp /media/ephemeral0/maven3-agent.jar:/media/ephemeral0/tools/hudson.tasks.Maven_MavenInstallation/Maven_3.0.4/boot/plexus-classworlds-2.4.jar org.jvnet.hudson.maven3.agent.Maven3Main /media/ephemeral0/tools/hudson.tasks.Maven_MavenInstallation/Maven_3.0.4 /tmp/slave.jar /media/ephemeral0/maven3-interceptor.jar 36082
<===[JENKINS REMOTING CAPACITY]===>channel started
log4j:WARN No appenders could be found for logger (org.apache.commons.beanutils.converters.BooleanConverter).
log4j:WARN Please initialize the log4j system properly.
Executing Maven:  -B -f /media/ephemeral0/workspace/sequtils/pom.xml -U -e clean source:jar package jar:test-jar
[INFO] Error stacktraces are turned on.
[INFO] Scanning for projects...
Downloading: http://dev.davidsoergel.com/nexus/content/groups/public/org/apache/maven/wagon/wagon-ssh-external/1.0/wagon-ssh-external-1.0.pom
Downloaded: http://dev.davidsoergel.com/nexus/content/groups/public/org/apache/maven/wagon/wagon-ssh-external/1.0/wagon-ssh-external-1.0.pom (3 KB at 7.5 KB/sec)
Downloading: http://dev.davidsoergel.com/nexus/content/groups/public/org/apache/maven/wagon/wagon-providers/1.0/wagon-providers-1.0.pom
Downloaded: http://dev.davidsoergel.com/nexus/content/groups/public/org/apache/maven/wagon/wagon-providers/1.0/wagon-providers-1.0.pom (3 KB at 21.2 KB/sec)
Downloading: http://dev.davidsoergel.com/nexus/content/groups/public/org/apache/maven/wagon/wagon/1.0/wagon-1.0.pom
Downloaded: http://dev.davidsoergel.com/nexus/content/groups/public/org/apache/maven/wagon/wagon/1.0/wagon-1.0.pom (10 KB at 200.1 KB/sec)
Downloading: http://dev.davidsoergel.com/nexus/content/groups/public/org/apache/maven/maven-parent/20/maven-parent-20.pom
Downloaded: http://dev.davidsoergel.com/nexus/content/groups/public/org/apache/maven/maven-parent/20/maven-parent-20.pom (25 KB at 233.4 KB/sec)
Downloading: http://dev.davidsoergel.com/nexus/content/groups/public/org/apache/apache/9/apache-9.pom
Downloaded: http://dev.davidsoergel.com/nexus/content/groups/public/org/apache/apache/9/apache-9.pom (15 KB at 279.3 KB/sec)
Downloading: http://dev.davidsoergel.com/nexus/content/groups/public/org/codehaus/plexus/plexus-utils/1.4.2/plexus-utils-1.4.2.pom
Downloaded: http://dev.davidsoergel.com/nexus/content/groups/public/org/codehaus/plexus/plexus-utils/1.4.2/plexus-utils-1.4.2.pom (2 KB at 14.0 KB/sec)
Downloading: http://dev.davidsoergel.com/nexus/content/groups/public/org/codehaus/plexus/plexus/1.0.11/plexus-1.0.11.pom
Downloaded: http://dev.davidsoergel.com/nexus/content/groups/public/org/codehaus/plexus/plexus/1.0.11/plexus-1.0.11.pom (9 KB at 93.2 KB/sec)
Downloading: http://dev.davidsoergel.com/nexus/content/groups/public/org/apache/maven/wagon/wagon-ssh-common/1.0/wagon-ssh-common-1.0.pom
Downloaded: http://dev.davidsoergel.com/nexus/content/groups/public/org/apache/maven/wagon/wagon-ssh-common/1.0/wagon-ssh-common-1.0.pom (2 KB at 11.0 KB/sec)
Downloading: http://dev.davidsoergel.com/nexus/content/groups/public/org/codehaus/plexus/plexus-interactivity-api/1.0-alpha-6/plexus-interactivity-api-1.0-alpha-6.pom
Downloaded: http://dev.davidsoergel.com/nexus/content/groups/public/org/codehaus/plexus/plexus-interactivity-api/1.0-alpha-6/plexus-interactivity-api-1.0-alpha-6.pom (726 B at 6.4 KB/sec)
Downloading: http://dev.davidsoergel.com/nexus/content/groups/public/org/codehaus/plexus/plexus-interactivity/1.0-alpha-6/plexus-interactivity-1.0-alpha-6.pom
Downloaded: http://dev.davidsoergel.com/nexus/content/groups/public/org/codehaus/plexus/plexus-interactivity/1.0-alpha-6/plexus-interactivity-1.0-alpha-6.pom (2 KB at 9.2 KB/sec)
Downloading: http://dev.davidsoergel.com/nexus/content/groups/public/org/codehaus/plexus/plexus-components/1.1.9/plexus-components-1.1.9.pom
Downloaded: http://dev.davidsoergel.com/nexus/content/groups/public/org/codehaus/plexus/plexus-components/1.1.9/plexus-components-1.1.9.pom (3 KB at 81.8 KB/sec)
Downloading: http://dev.davidsoergel.com/nexus/content/groups/public/org/codehaus/plexus/plexus/1.0.10/plexus-1.0.10.pom
Downloaded: http://dev.davidsoergel.com/nexus/content/groups/public/org/codehaus/plexus/plexus/1.0.10/plexus-1.0.10.pom (9 KB at 75.3 KB/sec)
Downloading: http://dev.davidsoergel.com/nexus/content/groups/public/org/apache/maven/wagon/wagon-provider-api/1.0/wagon-provider-api-1.0.pom
Downloaded: http://dev.davidsoergel.com/nexus/content/groups/public/org/apache/maven/wagon/wagon-provider-api/1.0/wagon-provider-api-1.0.pom (2 KB at 38.0 KB/sec)
Downloading: http://dev.davidsoergel.com/nexus/content/groups/public/org/apache/maven/wagon/wagon-ssh-external/1.0/wagon-ssh-external-1.0.jar
Downloading: http://dev.davidsoergel.com/nexus/content/groups/public/org/apache/maven/wagon/wagon-ssh-common/1.0/wagon-ssh-common-1.0.jar
Downloading: http://dev.davidsoergel.com/nexus/content/groups/public/org/codehaus/plexus/plexus-utils/1.4.2/plexus-utils-1.4.2.jar
Downloading: http://dev.davidsoergel.com/nexus/content/groups/public/org/codehaus/plexus/plexus-interactivity-api/1.0-alpha-6/plexus-interactivity-api-1.0-alpha-6.jar
Downloaded: http://dev.davidsoergel.com/nexus/content/groups/public/org/apache/maven/wagon/wagon-ssh-external/1.0/wagon-ssh-external-1.0.jar (15 KB at 300.3 KB/sec)
Downloaded: http://dev.davidsoergel.com/nexus/content/groups/public/org/codehaus/plexus/plexus-interactivity-api/1.0-alpha-6/plexus-interactivity-api-1.0-alpha-6.jar (12 KB at 75.3 KB/sec)
Downloaded: http://dev.davidsoergel.com/nexus/content/groups/public/org/apache/maven/wagon/wagon-ssh-common/1.0/wagon-ssh-common-1.0.jar (26 KB at 114.3 KB/sec)
Downloaded: http://dev.davidsoergel.com/nexus/content/groups/public/org/codehaus/plexus/plexus-utils/1.4.2/plexus-utils-1.4.2.jar (186 KB at 743.4 KB/sec)
Downloading: http://dev.davidsoergel.com/nexus/content/groups/public/org/apache/maven/wagon/wagon-webdav/1.0-beta-2/wagon-webdav-1.0-beta-2.pom
Downloaded: http://dev.davidsoergel.com/nexus/content/groups/public/org/apache/maven/wagon/wagon-webdav/1.0-beta-2/wagon-webdav-1.0-beta-2.pom (2 KB at 46.1 KB/sec)
Downloading: http://dev.davidsoergel.com/nexus/content/groups/public/org/apache/maven/wagon/wagon-providers/1.0-beta-2/wagon-providers-1.0-beta-2.pom
Downloaded: http://dev.davidsoergel.com/nexus/content/groups/public/org/apache/maven/wagon/wagon-providers/1.0-beta-2/wagon-providers-1.0-beta-2.pom (2 KB at 14.3 KB/sec)
Downloading: http://dev.davidsoergel.com/nexus/content/groups/public/org/apache/maven/wagon/wagon/1.0-beta-2/wagon-1.0-beta-2.pom
Downloaded: http://dev.davidsoergel.com/nexus/content/groups/public/org/apache/maven/wagon/wagon/1.0-beta-2/wagon-1.0-beta-2.pom (6 KB at 34.6 KB/sec)
Downloading: http://dev.davidsoergel.com/nexus/content/groups/public/org/apache/maven/maven-parent/4/maven-parent-4.pom
Downloaded: http://dev.davidsoergel.com/nexus/content/groups/public/org/apache/maven/maven-parent/4/maven-parent-4.pom (10 KB at 76.3 KB/sec)
Downloading: http://dev.davidsoergel.com/nexus/content/groups/public/org/apache/apache/3/apache-3.pom
Downloaded: http://dev.davidsoergel.com/nexus/content/groups/public/org/apache/apache/3/apache-3.pom (4 KB at 101.5 KB/sec)
Downloading: http://dev.davidsoergel.com/nexus/content/groups/public/slide/slide-webdavlib/2.1/slide-webdavlib-2.1.pom
Downloaded: http://dev.davidsoergel.com/nexus/content/groups/public/slide/slide-webdavlib/2.1/slide-webdavlib-2.1.pom (648 B at 4.1 KB/sec)
Downloading: http://dev.davidsoergel.com/nexus/content/groups/public/commons-httpclient/commons-httpclient/2.0.2/commons-httpclient-2.0.2.pom
Downloaded: http://dev.davidsoergel.com/nexus/content/groups/public/commons-httpclient/commons-httpclient/2.0.2/commons-httpclient-2.0.2.pom (7 KB at 34.6 KB/sec)
Downloading: http://dev.davidsoergel.com/nexus/content/groups/public/commons-logging/commons-logging/1.0.3/commons-logging-1.0.3.pom
Downloaded: http://dev.davidsoergel.com/nexus/content/groups/public/commons-logging/commons-logging/1.0.3/commons-logging-1.0.3.pom (866 B at 4.5 KB/sec)
Downloading: http://dev.davidsoergel.com/nexus/content/groups/public/jdom/jdom/1.0/jdom-1.0.pom
Downloaded: http://dev.davidsoergel.com/nexus/content/groups/public/jdom/jdom/1.0/jdom-1.0.pom (2 KB at 8.8 KB/sec)
Downloading: http://dev.davidsoergel.com/nexus/content/groups/public/de/zeigermann/xml/xml-im-exporter/1.1/xml-im-exporter-1.1.pom
Downloaded: http://dev.davidsoergel.com/nexus/content/groups/public/de/zeigermann/xml/xml-im-exporter/1.1/xml-im-exporter-1.1.pom (248 B at 1.7 KB/sec)
Downloading: http://dev.davidsoergel.com/nexus/content/groups/public/commons-logging/commons-logging/1.0.4/commons-logging-1.0.4.pom
Downloaded: http://dev.davidsoergel.com/nexus/content/groups/public/commons-logging/commons-logging/1.0.4/commons-logging-1.0.4.pom (6 KB at 37.5 KB/sec)
Downloading: http://dev.davidsoergel.com/nexus/content/groups/public/org/apache/maven/wagon/wagon-provider-api/1.0-beta-2/wagon-provider-api-1.0-beta-2.pom
Downloaded: http://dev.davidsoergel.com/nexus/content/groups/public/org/apache/maven/wagon/wagon-provider-api/1.0-beta-2/wagon-provider-api-1.0-beta-2.pom (680 B at 16.6 KB/sec)
Downloading: http://dev.davidsoergel.com/nexus/content/groups/public/org/codehaus/plexus/plexus-utils/1.0.4/plexus-utils-1.0.4.pom
Downloaded: http://dev.davidsoergel.com/nexus/content/groups/public/org/codehaus/plexus/plexus-utils/1.0.4/plexus-utils-1.0.4.pom (7 KB at 209.2 KB/sec)
Downloading: http://dev.davidsoergel.com/nexus/content/groups/public/org/apache/maven/wagon/wagon-webdav/1.0-beta-2/wagon-webdav-1.0-beta-2.jar
Downloading: http://dev.davidsoergel.com/nexus/content/groups/public/commons-httpclient/commons-httpclient/2.0.2/commons-httpclient-2.0.2.jar
Downloading: http://dev.davidsoergel.com/nexus/content/groups/public/jdom/jdom/1.0/jdom-1.0.jar
Downloading: http://dev.davidsoergel.com/nexus/content/groups/public/slide/slide-webdavlib/2.1/slide-webdavlib-2.1.jar
Downloading: http://dev.davidsoergel.com/nexus/content/groups/public/de/zeigermann/xml/xml-im-exporter/1.1/xml-im-exporter-1.1.jar
Downloaded: http://dev.davidsoergel.com/nexus/content/groups/public/org/apache/maven/wagon/wagon-webdav/1.0-beta-2/wagon-webdav-1.0-beta-2.jar (17 KB at 98.8 KB/sec)
Downloading: http://dev.davidsoergel.com/nexus/content/groups/public/commons-logging/commons-logging/1.0.4/commons-logging-1.0.4.jar
Downloaded: http://dev.davidsoergel.com/nexus/content/groups/public/de/zeigermann/xml/xml-im-exporter/1.1/xml-im-exporter-1.1.jar (24 KB at 53.8 KB/sec)
Downloading: http://dev.davidsoergel.com/nexus/content/groups/public/org/codehaus/plexus/plexus-utils/1.0.4/plexus-utils-1.0.4.jar
Downloaded: http://dev.davidsoergel.com/nexus/content/groups/public/commons-httpclient/commons-httpclient/2.0.2/commons-httpclient-2.0.2.jar (221 KB at 332.5 KB/sec)
Downloaded: http://dev.davidsoergel.com/nexus/content/groups/public/slide/slide-webdavlib/2.1/slide-webdavlib-2.1.jar (169 KB at 258.7 KB/sec)
Downloaded: http://dev.davidsoergel.com/nexus/content/groups/public/commons-logging/commons-logging/1.0.4/commons-logging-1.0.4.jar (38 KB at 57.3 KB/sec)
Downloaded: http://dev.davidsoergel.com/nexus/content/groups/public/org/codehaus/plexus/plexus-utils/1.0.4/plexus-utils-1.0.4.jar (160 KB at 431.2 KB/sec)
Downloaded: http://dev.davidsoergel.com/nexus/content/groups/public/jdom/jdom/1.0/jdom-1.0.jar (150 KB at 75.8 KB/sec)
Downloading: http://dev.davidsoergel.com/nexus/content/groups/public/org/apache/maven/plugins/maven-compiler-plugin/2.4/maven-compiler-plugin-2.4.pom
Downloaded: http://dev.davidsoergel.com/nexus/content/groups/public/org/apache/maven/plugins/maven-compiler-plugin/2.4/maven-compiler-plugin-2.4.pom (7 KB at 149.5 KB/sec)
Downloading: http://dev.davidsoergel.com/nexus/content/groups/public/org/apache/maven/plugins/maven-plugins/22/maven-plugins-22.pom
Downloaded: http://dev.davidsoergel.com/nexus/content/groups/public/org/apache/maven/plugins/maven-plugins/22/maven-plugins-22.pom (13 KB at 353.7 KB/sec)
Downloading: http://dev.davidsoergel.com/nexus/content/groups/public/org/apache/maven/maven-parent/21/maven-parent-21.pom
Downloaded: http://dev.davidsoergel.com/nexus/content/groups/public/org/apache/maven/maven-parent/21/maven-parent-21.pom (26 KB at 265.4 KB/sec)
Downloading: http://dev.davidsoergel.com/nexus/content/groups/public/org/apache/apache/10/apache-10.pom
Downloaded: http://dev.davidsoergel.com/nexus/content/groups/public/org/apache/apache/10/apache-10.pom (15 KB at 451.6 KB/sec)
Downloading: http://dev.davidsoergel.com/nexus/content/groups/public/org/apache/maven/plugins/maven-compiler-plugin/2.4/maven-compiler-plugin-2.4.jar
Downloaded: http://dev.davidsoergel.com/nexus/content/groups/public/org/apache/maven/plugins/maven-compiler-plugin/2.4/maven-compiler-plugin-2.4.jar (30 KB at 331.1 KB/sec)
Downloading: http://dev.davidsoergel.com/nexus/content/groups/public/org/apache/maven/plugins/maven-jar-plugin/2.4/maven-jar-plugin-2.4.pom
Downloaded: http://dev.davidsoergel.com/nexus/content/groups/public/org/apache/maven/plugins/maven-jar-plugin/2.4/maven-jar-plugin-2.4.pom (6 KB at 172.6 KB/sec)
Downloading: http://dev.davidsoergel.com/nexus/content/groups/public/org/apache/maven/plugins/maven-jar-plugin/2.4/maven-jar-plugin-2.4.jar
Downloaded: http://dev.davidsoergel.com/nexus/content/groups/public/org/apache/maven/plugins/maven-jar-plugin/2.4/maven-jar-plugin-2.4.jar (34 KB at 125.9 KB/sec)
Downloading: http://dev.davidsoergel.com/nexus/content/groups/public/org/apache/maven/plugins/maven-surefire-plugin/2.12/maven-surefire-plugin-2.12.pom
Downloaded: http://dev.davidsoergel.com/nexus/content/groups/public/org/apache/maven/plugins/maven-surefire-plugin/2.12/maven-surefire-plugin-2.12.pom (10 KB at 92.9 KB/sec)
Downloading: http://dev.davidsoergel.com/nexus/content/groups/public/org/apache/maven/surefire/surefire/2.12/surefire-2.12.pom
Downloaded: http://dev.davidsoergel.com/nexus/content/groups/public/org/apache/maven/surefire/surefire/2.12/surefire-2.12.pom (11 KB at 255.2 KB/sec)
Downloading: http://dev.davidsoergel.com/nexus/content/groups/public/org/apache/maven/plugins/maven-surefire-plugin/2.12/maven-surefire-plugin-2.12.jar
Downloaded: http://dev.davidsoergel.com/nexus/content/groups/public/org/apache/maven/plugins/maven-surefire-plugin/2.12/maven-surefire-plugin-2.12.jar (31 KB at 230.1 KB/sec)
Downloading: http://dev.davidsoergel.com/nexus/content/groups/public/org/codehaus/mojo/cobertura-maven-plugin/2.5.1/cobertura-maven-plugin-2.5.1.pom
Downloaded: http://dev.davidsoergel.com/nexus/content/groups/public/org/codehaus/mojo/cobertura-maven-plugin/2.5.1/cobertura-maven-plugin-2.5.1.pom (10 KB at 205.7 KB/sec)
Downloading: http://dev.davidsoergel.com/nexus/content/groups/public/org/codehaus/mojo/mojo-parent/28/mojo-parent-28.pom
Downloaded: http://dev.davidsoergel.com/nexus/content/groups/public/org/codehaus/mojo/mojo-parent/28/mojo-parent-28.pom (26 KB at 832.3 KB/sec)
Downloading: http://dev.davidsoergel.com/nexus/content/groups/public/org/codehaus/codehaus-parent/3/codehaus-parent-3.pom
Downloaded: http://dev.davidsoergel.com/nexus/content/groups/public/org/codehaus/codehaus-parent/3/codehaus-parent-3.pom (5 KB at 34.9 KB/sec)
Downloading: http://dev.davidsoergel.com/nexus/content/groups/public/org/codehaus/mojo/cobertura-maven-plugin/2.5.1/cobertura-maven-plugin-2.5.1.jar
Downloaded: http://dev.davidsoergel.com/nexus/content/groups/public/org/codehaus/mojo/cobertura-maven-plugin/2.5.1/cobertura-maven-plugin-2.5.1.jar (47 KB at 498.7 KB/sec)
Downloading: http://dev.davidsoergel.com/nexus/content/groups/public/org/apache/maven/plugins/maven-clean-plugin/2.4.1/maven-clean-plugin-2.4.1.pom
Downloaded: http://dev.davidsoergel.com/nexus/content/groups/public/org/apache/maven/plugins/maven-clean-plugin/2.4.1/maven-clean-plugin-2.4.1.pom (5 KB at 106.8 KB/sec)
Downloading: http://dev.davidsoergel.com/nexus/content/groups/public/org/apache/maven/plugins/maven-plugins/18/maven-plugins-18.pom
Downloaded: http://dev.davidsoergel.com/nexus/content/groups/public/org/apache/maven/plugins/maven-plugins/18/maven-plugins-18.pom (13 KB at 95.5 KB/sec)
Downloading: http://dev.davidsoergel.com/nexus/content/groups/public/org/apache/maven/maven-parent/16/maven-parent-16.pom
Downloaded: http://dev.davidsoergel.com/nexus/content/groups/public/org/apache/maven/maven-parent/16/maven-parent-16.pom (23 KB at 201.1 KB/sec)
Downloading: http://dev.davidsoergel.com/nexus/content/groups/public/org/apache/apache/7/apache-7.pom
Downloaded: http://dev.davidsoergel.com/nexus/content/groups/public/org/apache/apache/7/apache-7.pom (15 KB at 243.0 KB/sec)
Downloading: http://dev.davidsoergel.com/nexus/content/groups/public/org/apache/maven/plugins/maven-clean-plugin/2.4.1/maven-clean-plugin-2.4.1.jar
Downloaded: http://dev.davidsoergel.com/nexus/content/groups/public/org/apache/maven/plugins/maven-clean-plugin/2.4.1/maven-clean-plugin-2.4.1.jar (23 KB at 766.6 KB/sec)
Downloading: http://dev.davidsoergel.com/nexus/content/groups/public/org/apache/maven/plugins/maven-install-plugin/2.3.1/maven-install-plugin-2.3.1.pom
Downloaded: http://dev.davidsoergel.com/nexus/content/groups/public/org/apache/maven/plugins/maven-install-plugin/2.3.1/maven-install-plugin-2.3.1.pom (5 KB at 71.2 KB/sec)
Downloading: http://dev.davidsoergel.com/nexus/content/groups/public/org/apache/maven/plugins/maven-install-plugin/2.3.1/maven-install-plugin-2.3.1.jar
Downloaded: http://dev.davidsoergel.com/nexus/content/groups/public/org/apache/maven/plugins/maven-install-plugin/2.3.1/maven-install-plugin-2.3.1.jar (23 KB at 766.4 KB/sec)
Downloading: http://dev.davidsoergel.com/nexus/content/groups/public/org/apache/maven/plugins/maven-resources-plugin/2.5/maven-resources-plugin-2.5.pom
Downloaded: http://dev.davidsoergel.com/nexus/content/groups/public/org/apache/maven/plugins/maven-resources-plugin/2.5/maven-resources-plugin-2.5.pom (7 KB at 161.6 KB/sec)
Downloading: http://dev.davidsoergel.com/nexus/content/groups/public/org/apache/maven/plugins/maven-plugins/19/maven-plugins-19.pom
Downloaded: http://dev.davidsoergel.com/nexus/content/groups/public/org/apache/maven/plugins/maven-plugins/19/maven-plugins-19.pom (11 KB at 290.5 KB/sec)
Downloading: http://dev.davidsoergel.com/nexus/content/groups/public/org/apache/maven/maven-parent/19/maven-parent-19.pom
Downloaded: http://dev.davidsoergel.com/nexus/content/groups/public/org/apache/maven/maven-parent/19/maven-parent-19.pom (25 KB at 452.2 KB/sec)
Downloading: http://dev.davidsoergel.com/nexus/content/groups/public/org/apache/maven/plugins/maven-resources-plugin/2.5/maven-resources-plugin-2.5.jar
Downloaded: http://dev.davidsoergel.com/nexus/content/groups/public/org/apache/maven/plugins/maven-resources-plugin/2.5/maven-resources-plugin-2.5.jar (26 KB at 440.5 KB/sec)
Downloading: http://dev.davidsoergel.com/nexus/content/groups/public/org/apache/maven/plugins/maven-deploy-plugin/2.7/maven-deploy-plugin-2.7.pom
Downloaded: http://dev.davidsoergel.com/nexus/content/groups/public/org/apache/maven/plugins/maven-deploy-plugin/2.7/maven-deploy-plugin-2.7.pom (6 KB at 171.3 KB/sec)
Downloading: http://dev.davidsoergel.com/nexus/content/groups/public/org/apache/maven/plugins/maven-deploy-plugin/2.7/maven-deploy-plugin-2.7.jar
Downloaded: http://dev.davidsoergel.com/nexus/content/groups/public/org/apache/maven/plugins/maven-deploy-plugin/2.7/maven-deploy-plugin-2.7.jar (27 KB at 287.9 KB/sec)
Downloading: http://dev.davidsoergel.com/nexus/content/groups/public/org/apache/maven/plugins/maven-site-plugin/3.1/maven-site-plugin-3.1.pom
Downloaded: http://dev.davidsoergel.com/nexus/content/groups/public/org/apache/maven/plugins/maven-site-plugin/3.1/maven-site-plugin-3.1.pom (18 KB at 104.0 KB/sec)
Downloading: http://dev.davidsoergel.com/nexus/content/groups/public/org/apache/maven/plugins/maven-site-plugin/3.1/maven-site-plugin-3.1.jar
Downloaded: http://dev.davidsoergel.com/nexus/content/groups/public/org/apache/maven/plugins/maven-site-plugin/3.1/maven-site-plugin-3.1.jar (117 KB at 1216.1 KB/sec)
Downloading: http://dev.davidsoergel.com/nexus/content/groups/public/org/apache/maven/plugins/maven-antrun-plugin/1.3/maven-antrun-plugin-1.3.pom
Downloaded: http://dev.davidsoergel.com/nexus/content/groups/public/org/apache/maven/plugins/maven-antrun-plugin/1.3/maven-antrun-plugin-1.3.pom (5 KB at 55.0 KB/sec)
Downloading: http://dev.davidsoergel.com/nexus/content/groups/public/org/apache/maven/plugins/maven-plugins/12/maven-plugins-12.pom
Downloaded: http://dev.davidsoergel.com/nexus/content/groups/public/org/apache/maven/plugins/maven-plugins/12/maven-plugins-12.pom (12 KB at 86.3 KB/sec)
Downloading: http://dev.davidsoergel.com/nexus/content/groups/public/org/apache/maven/maven-parent/9/maven-parent-9.pom
Downloaded: http://dev.davidsoergel.com/nexus/content/groups/public/org/apache/maven/maven-parent/9/maven-parent-9.pom (33 KB at 267.2 KB/sec)
Downloading: http://dev.davidsoergel.com/nexus/content/groups/public/org/apache/apache/4/apache-4.pom
Downloaded: http://dev.davidsoergel.com/nexus/content/groups/public/org/apache/apache/4/apache-4.pom (5 KB at 48.8 KB/sec)
Downloading: http://dev.davidsoergel.com/nexus/content/groups/public/org/apache/maven/plugins/maven-antrun-plugin/1.3/maven-antrun-plugin-1.3.jar
Downloaded: http://dev.davidsoergel.com/nexus/content/groups/public/org/apache/maven/plugins/maven-antrun-plugin/1.3/maven-antrun-plugin-1.3.jar (24 KB at 193.4 KB/sec)
Downloading: http://dev.davidsoergel.com/nexus/content/groups/public/org/apache/maven/plugins/maven-assembly-plugin/2.2-beta-5/maven-assembly-plugin-2.2-beta-5.pom
Downloaded: http://dev.davidsoergel.com/nexus/content/groups/public/org/apache/maven/plugins/maven-assembly-plugin/2.2-beta-5/maven-assembly-plugin-2.2-beta-5.pom (15 KB at 119.4 KB/sec)
Downloading: http://dev.davidsoergel.com/nexus/content/groups/public/org/apache/maven/plugins/maven-plugins/16/maven-plugins-16.pom
Downloaded: http://dev.davidsoergel.com/nexus/content/groups/public/org/apache/maven/plugins/maven-plugins/16/maven-plugins-16.pom (13 KB at 93.0 KB/sec)
Downloading: http://dev.davidsoergel.com/nexus/content/groups/public/org/apache/maven/maven-parent/15/maven-parent-15.pom
Downloaded: http://dev.davidsoergel.com/nexus/content/groups/public/org/apache/maven/maven-parent/15/maven-parent-15.pom (24 KB at 781.3 KB/sec)
Downloading: http://dev.davidsoergel.com/nexus/content/groups/public/org/apache/apache/6/apache-6.pom
Downloaded: http://dev.davidsoergel.com/nexus/content/groups/public/org/apache/apache/6/apache-6.pom (13 KB at 85.6 KB/sec)
Downloading: http://dev.davidsoergel.com/nexus/content/groups/public/org/apache/maven/plugins/maven-assembly-plugin/2.2-beta-5/maven-assembly-plugin-2.2-beta-5.jar
Downloaded: http://dev.davidsoergel.com/nexus/content/groups/public/org/apache/maven/plugins/maven-assembly-plugin/2.2-beta-5/maven-assembly-plugin-2.2-beta-5.jar (204 KB at 1581.2 KB/sec)
Downloading: http://dev.davidsoergel.com/nexus/content/groups/public/org/apache/maven/plugins/maven-dependency-plugin/2.1/maven-dependency-plugin-2.1.pom
Downloaded: http://dev.davidsoergel.com/nexus/content/groups/public/org/apache/maven/plugins/maven-dependency-plugin/2.1/maven-dependency-plugin-2.1.pom (8 KB at 155.9 KB/sec)
Downloading: http://dev.davidsoergel.com/nexus/content/groups/public/org/apache/maven/plugins/maven-dependency-plugin/2.1/maven-dependency-plugin-2.1.jar
Downloaded: http://dev.davidsoergel.com/nexus/content/groups/public/org/apache/maven/plugins/maven-dependency-plugin/2.1/maven-dependency-plugin-2.1.jar (104 KB at 3047.0 KB/sec)
Downloading: http://dev.davidsoergel.com/nexus/content/groups/public/org/apache/maven/plugins/maven-release-plugin/2.0/maven-release-plugin-2.0.pom
Downloaded: http://dev.davidsoergel.com/nexus/content/groups/public/org/apache/maven/plugins/maven-release-plugin/2.0/maven-release-plugin-2.0.pom (8 KB at 68.2 KB/sec)
Downloading: http://dev.davidsoergel.com/nexus/content/groups/public/org/apache/maven/release/maven-release/2.0/maven-release-2.0.pom
Downloaded: http://dev.davidsoergel.com/nexus/content/groups/public/org/apache/maven/release/maven-release/2.0/maven-release-2.0.pom (7 KB at 38.9 KB/sec)
Downloading: http://dev.davidsoergel.com/nexus/content/groups/public/org/apache/maven/plugins/maven-release-plugin/2.0/maven-release-plugin-2.0.jar
Downloaded: http://dev.davidsoergel.com/nexus/content/groups/public/org/apache/maven/plugins/maven-release-plugin/2.0/maven-release-plugin-2.0.jar (38 KB at 310.8 KB/sec)
Downloading: http://dev.davidsoergel.com/nexus/content/groups/public/org/apache/maven/plugins/maven-metadata.xml
Downloading: http://repo.maven.apache.org/maven2/org/apache/maven/plugins/maven-metadata.xml
Downloading: http://dev.davidsoergel.com/nexus/content/groups/public/org/codehaus/mojo/maven-metadata.xml
Downloading: http://repo.maven.apache.org/maven2/org/codehaus/mojo/maven-metadata.xml
Downloaded: http://repo.maven.apache.org/maven2/org/codehaus/mojo/maven-metadata.xml (22 KB at 156.7 KB/sec)
Downloaded: http://repo.maven.apache.org/maven2/org/apache/maven/plugins/maven-metadata.xml (11 KB at 75.0 KB/sec)
Downloaded: http://dev.davidsoergel.com/nexus/content/groups/public/org/codehaus/mojo/maven-metadata.xml (22 KB at 53.7 KB/sec)
Downloaded: http://dev.davidsoergel.com/nexus/content/groups/public/org/apache/maven/plugins/maven-metadata.xml (11 KB at 19.3 KB/sec)
Downloading: http://dev.davidsoergel.com/nexus/content/groups/public/org/apache/maven/plugins/maven-source-plugin/maven-metadata.xml
Downloading: http://repo.maven.apache.org/maven2/org/apache/maven/plugins/maven-source-plugin/maven-metadata.xml
Downloaded: http://repo.maven.apache.org/maven2/org/apache/maven/plugins/maven-source-plugin/maven-metadata.xml (692 B at 6.8 KB/sec)
Downloaded: http://dev.davidsoergel.com/nexus/content/groups/public/org/apache/maven/plugins/maven-source-plugin/maven-metadata.xml (692 B at 1.9 KB/sec)
Downloading: http://dev.davidsoergel.com/nexus/content/groups/public/org/apache/maven/plugins/maven-source-plugin/2.2.1/maven-source-plugin-2.2.1.pom
Downloaded: http://dev.davidsoergel.com/nexus/content/groups/public/org/apache/maven/plugins/maven-source-plugin/2.2.1/maven-source-plugin-2.2.1.pom (7 KB at 47.9 KB/sec)
Downloading: http://dev.davidsoergel.com/nexus/content/groups/public/org/apache/maven/plugins/maven-plugins/23/maven-plugins-23.pom
Downloaded: http://dev.davidsoergel.com/nexus/content/groups/public/org/apache/maven/plugins/maven-plugins/23/maven-plugins-23.pom (9 KB at 58.7 KB/sec)
Downloading: http://dev.davidsoergel.com/nexus/content/groups/public/org/apache/maven/maven-parent/22/maven-parent-22.pom
Downloaded: http://dev.davidsoergel.com/nexus/content/groups/public/org/apache/maven/maven-parent/22/maven-parent-22.pom (30 KB at 907.7 KB/sec)
Downloading: http://dev.davidsoergel.com/nexus/content/groups/public/org/apache/apache/11/apache-11.pom
Downloaded: http://dev.davidsoergel.com/nexus/content/groups/public/org/apache/apache/11/apache-11.pom (15 KB at 263.0 KB/sec)
Downloading: http://dev.davidsoergel.com/nexus/content/groups/public/org/apache/maven/plugins/maven-source-plugin/2.2.1/maven-source-plugin-2.2.1.jar
Downloaded: http://dev.davidsoergel.com/nexus/content/groups/public/org/apache/maven/plugins/maven-source-plugin/2.2.1/maven-source-plugin-2.2.1.jar (30 KB at 353.2 KB/sec)
[INFO]                                                                         
[INFO] ------------------------------------------------------------------------
[INFO] Building sequtils 0.92-SNAPSHOT
[INFO] ------------------------------------------------------------------------
Downloading: http://dev.davidsoergel.com/nexus/content/groups/public/com/davidsoergel/dsutils/1.05/dsutils-1.05.pom
Downloaded: http://dev.davidsoergel.com/nexus/content/groups/public/com/davidsoergel/dsutils/1.05/dsutils-1.05.pom (5 KB at 4.3 KB/sec)
Downloading: http://dev.davidsoergel.com/nexus/content/groups/public/com/davidsoergel/basepom/1.0/basepom-1.0.pom
Downloaded: http://dev.davidsoergel.com/nexus/content/groups/public/com/davidsoergel/basepom/1.0/basepom-1.0.pom (11 KB at 211.4 KB/sec)
Downloading: http://dev.davidsoergel.com/nexus/content/groups/public/commons-lang/commons-lang/2.6/commons-lang-2.6.pom
Downloaded: http://dev.davidsoergel.com/nexus/content/groups/public/commons-lang/commons-lang/2.6/commons-lang-2.6.pom (18 KB at 131.4 KB/sec)
Downloading: http://dev.davidsoergel.com/nexus/content/groups/public/org/apache/commons/commons-parent/17/commons-parent-17.pom
Downloaded: http://dev.davidsoergel.com/nexus/content/groups/public/org/apache/commons/commons-parent/17/commons-parent-17.pom (31 KB at 499.2 KB/sec)
Downloading: http://dev.davidsoergel.com/nexus/content/groups/public/commons-logging/commons-logging/1.1.1/commons-logging-1.1.1.pom
Downloaded: http://dev.davidsoergel.com/nexus/content/groups/public/commons-logging/commons-logging/1.1.1/commons-logging-1.1.1.pom (18 KB at 88.8 KB/sec)
Downloading: http://dev.davidsoergel.com/nexus/content/groups/public/org/apache/commons/commons-parent/5/commons-parent-5.pom
Downloaded: http://dev.davidsoergel.com/nexus/content/groups/public/org/apache/commons/commons-parent/5/commons-parent-5.pom (16 KB at 164.9 KB/sec)
Downloading: http://dev.davidsoergel.com/nexus/content/groups/public/net/sourceforge/collections/collections-generic/4.01/collections-generic-4.01.pom
Downloaded: http://dev.davidsoergel.com/nexus/content/groups/public/net/sourceforge/collections/collections-generic/4.01/collections-generic-4.01.pom (585 B at 3.9 KB/sec)
Downloading: http://dev.davidsoergel.com/nexus/content/groups/public/com/google/collections/google-collections/1.0/google-collections-1.0.pom
Downloaded: http://dev.davidsoergel.com/nexus/content/groups/public/com/google/collections/google-collections/1.0/google-collections-1.0.pom (3 KB at 46.5 KB/sec)
Downloading: http://dev.davidsoergel.com/nexus/content/groups/public/com/google/google/1/google-1.pom
Downloaded: http://dev.davidsoergel.com/nexus/content/groups/public/com/google/google/1/google-1.pom (2 KB at 17.2 KB/sec)
Downloading: http://dev.davidsoergel.com/nexus/content/groups/public/org/slf4j/slf4j-log4j12/1.6.4/slf4j-log4j12-1.6.4.pom
Downloaded: http://dev.davidsoergel.com/nexus/content/groups/public/org/slf4j/slf4j-log4j12/1.6.4/slf4j-log4j12-1.6.4.pom (2 KB at 12.4 KB/sec)
Downloading: http://dev.davidsoergel.com/nexus/content/groups/public/org/slf4j/slf4j-parent/1.6.4/slf4j-parent-1.6.4.pom
Downloaded: http://dev.davidsoergel.com/nexus/content/groups/public/org/slf4j/slf4j-parent/1.6.4/slf4j-parent-1.6.4.pom (12 KB at 397.2 KB/sec)
Downloading: http://dev.davidsoergel.com/nexus/content/groups/public/org/slf4j/slf4j-api/1.6.4/slf4j-api-1.6.4.pom
Downloaded: http://dev.davidsoergel.com/nexus/content/groups/public/org/slf4j/slf4j-api/1.6.4/slf4j-api-1.6.4.pom (3 KB at 10.3 KB/sec)
Downloading: http://dev.davidsoergel.com/nexus/content/groups/public/log4j/log4j/1.2.16/log4j-1.2.16.pom
Downloaded: http://dev.davidsoergel.com/nexus/content/groups/public/log4j/log4j/1.2.16/log4j-1.2.16.pom (20 KB at 54.1 KB/sec)
Downloading: http://dev.davidsoergel.com/nexus/content/groups/public/com/intellij/annotations/7.0.3/annotations-7.0.3.pom
Downloaded: http://dev.davidsoergel.com/nexus/content/groups/public/com/intellij/annotations/7.0.3/annotations-7.0.3.pom (2 KB at 10.8 KB/sec)
Downloading: http://dev.davidsoergel.com/nexus/content/groups/public/com/davidsoergel/stats/0.93/stats-0.93.pom
Downloaded: http://dev.davidsoergel.com/nexus/content/groups/public/com/davidsoergel/stats/0.93/stats-0.93.pom (5 KB at 7.1 KB/sec)
Downloading: http://dev.davidsoergel.com/nexus/content/groups/public/edu/berkeley/compbio/ml/0.92/ml-0.92.pom
Downloaded: http://dev.davidsoergel.com/nexus/content/groups/public/edu/berkeley/compbio/ml/0.92/ml-0.92.pom (7 KB at 3.0 KB/sec)
Downloading: http://dev.davidsoergel.com/nexus/content/groups/public/com/davidsoergel/conja/1.06/conja-1.06.pom
Downloaded: http://dev.davidsoergel.com/nexus/content/groups/public/com/davidsoergel/conja/1.06/conja-1.06.pom (4 KB at 41.4 KB/sec)
Downloading: http://dev.davidsoergel.com/nexus/content/groups/public/com/davidsoergel/trees/1.03/trees-1.03.pom
Downloaded: http://dev.davidsoergel.com/nexus/content/groups/public/com/davidsoergel/trees/1.03/trees-1.03.pom (5 KB at 13.0 KB/sec)
Downloading: http://dev.davidsoergel.com/nexus/content/groups/public/com/davidsoergel/runutils/0.91/runutils-0.91.pom
Downloaded: http://dev.davidsoergel.com/nexus/content/groups/public/com/davidsoergel/runutils/0.91/runutils-0.91.pom (5 KB at 2.5 KB/sec)
Downloading: http://dev.davidsoergel.com/nexus/content/groups/public/com/martiansoftware/JSAP/2.0a-ds1/JSAP-2.0a-ds1.pom
Downloaded: http://dev.davidsoergel.com/nexus/content/groups/public/com/martiansoftware/JSAP/2.0a-ds1/JSAP-2.0a-ds1.pom (246 B at 1.3 KB/sec)
Downloading: http://dev.davidsoergel.com/nexus/content/groups/public/commons-collections/commons-collections/3.2/commons-collections-3.2.pom
Downloaded: http://dev.davidsoergel.com/nexus/content/groups/public/commons-collections/commons-collections/3.2/commons-collections-3.2.pom (11 KB at 71.8 KB/sec)
Downloading: http://dev.davidsoergel.com/nexus/content/groups/public/org/easymock/easymock/2.0/easymock-2.0.pom
Downloaded: http://dev.davidsoergel.com/nexus/content/groups/public/org/easymock/easymock/2.0/easymock-2.0.pom (2 KB at 5.7 KB/sec)
Downloading: http://dev.davidsoergel.com/nexus/content/groups/public/org/testng/testng/5.14.10/testng-5.14.10.pom
Downloaded: http://dev.davidsoergel.com/nexus/content/groups/public/org/testng/testng/5.14.10/testng-5.14.10.pom (7 KB at 229.8 KB/sec)
Downloading: http://dev.davidsoergel.com/nexus/content/groups/public/org/sonatype/oss/oss-parent/3/oss-parent-3.pom
Downloaded: http://dev.davidsoergel.com/nexus/content/groups/public/org/sonatype/oss/oss-parent/3/oss-parent-3.pom (4 KB at 27.0 KB/sec)
Downloading: http://dev.davidsoergel.com/nexus/content/groups/public/junit/junit/3.8.1/junit-3.8.1.pom
Downloaded: http://dev.davidsoergel.com/nexus/content/groups/public/junit/junit/3.8.1/junit-3.8.1.pom (998 B at 7.2 KB/sec)
Downloading: http://dev.davidsoergel.com/nexus/content/groups/public/org/beanshell/bsh/2.0b4/bsh-2.0b4.pom
Downloaded: http://dev.davidsoergel.com/nexus/content/groups/public/org/beanshell/bsh/2.0b4/bsh-2.0b4.pom (2 KB at 13.6 KB/sec)
Downloading: http://dev.davidsoergel.com/nexus/content/groups/public/org/beanshell/beanshell/2.0b4/beanshell-2.0b4.pom
Downloaded: http://dev.davidsoergel.com/nexus/content/groups/public/org/beanshell/beanshell/2.0b4/beanshell-2.0b4.pom (2 KB at 25.1 KB/sec)
Downloading: http://dev.davidsoergel.com/nexus/content/groups/public/com/beust/jcommander/1.12/jcommander-1.12.pom
Downloaded: http://dev.davidsoergel.com/nexus/content/groups/public/com/beust/jcommander/1.12/jcommander-1.12.pom (8 KB at 78.6 KB/sec)
Downloading: http://dev.davidsoergel.com/nexus/content/groups/public/org/yaml/snakeyaml/1.6/snakeyaml-1.6.pom
Downloaded: http://dev.davidsoergel.com/nexus/content/groups/public/org/yaml/snakeyaml/1.6/snakeyaml-1.6.pom (8 KB at 145.7 KB/sec)
Downloading: http://dev.davidsoergel.com/nexus/content/groups/public/com/davidsoergel/dsutils/1.05/dsutils-1.05.jar
Downloading: http://dev.davidsoergel.com/nexus/content/groups/public/commons-lang/commons-lang/2.6/commons-lang-2.6.jar
Downloading: http://dev.davidsoergel.com/nexus/content/groups/public/commons-logging/commons-logging/1.1.1/commons-logging-1.1.1.jar
Downloading: http://dev.davidsoergel.com/nexus/content/groups/public/net/sourceforge/collections/collections-generic/4.01/collections-generic-4.01.jar
Downloading: http://dev.davidsoergel.com/nexus/content/groups/public/com/google/collections/google-collections/1.0/google-collections-1.0.jar
Downloaded: http://dev.davidsoergel.com/nexus/content/groups/public/commons-logging/commons-logging/1.1.1/commons-logging-1.1.1.jar (60 KB at 316.9 KB/sec)
Downloading: http://dev.davidsoergel.com/nexus/content/groups/public/com/davidsoergel/dsutils/1.05/dsutils-1.05-tests.jar
Downloaded: http://dev.davidsoergel.com/nexus/content/groups/public/commons-lang/commons-lang/2.6/commons-lang-2.6.jar (278 KB at 1009.3 KB/sec)
Downloading: http://dev.davidsoergel.com/nexus/content/groups/public/com/davidsoergel/stats/0.93/stats-0.93.jar
Downloaded: http://dev.davidsoergel.com/nexus/content/groups/public/net/sourceforge/collections/collections-generic/4.01/collections-generic-4.01.jar (520 KB at 1860.6 KB/sec)
Downloading: http://dev.davidsoergel.com/nexus/content/groups/public/edu/berkeley/compbio/ml/0.92/ml-0.92.jar
Downloaded: http://dev.davidsoergel.com/nexus/content/groups/public/com/google/collections/google-collections/1.0/google-collections-1.0.jar (625 KB at 2176.3 KB/sec)
Downloading: http://dev.davidsoergel.com/nexus/content/groups/public/com/davidsoergel/conja/1.06/conja-1.06.jar
Downloaded: http://dev.davidsoergel.com/nexus/content/groups/public/com/davidsoergel/dsutils/1.05/dsutils-1.05.jar (302 KB at 721.5 KB/sec)
Downloading: http://dev.davidsoergel.com/nexus/content/groups/public/com/davidsoergel/trees/1.03/trees-1.03.jar
Downloaded: http://dev.davidsoergel.com/nexus/content/groups/public/com/davidsoergel/conja/1.06/conja-1.06.jar (31 KB at 150.7 KB/sec)
Downloading: http://dev.davidsoergel.com/nexus/content/groups/public/com/davidsoergel/runutils/0.91/runutils-0.91.jar
Downloaded: http://dev.davidsoergel.com/nexus/content/groups/public/com/davidsoergel/stats/0.93/stats-0.93.jar (57 KB at 194.4 KB/sec)
Downloading: http://dev.davidsoergel.com/nexus/content/groups/public/com/martiansoftware/JSAP/2.0a-ds1/JSAP-2.0a-ds1.jar
Downloaded: http://dev.davidsoergel.com/nexus/content/groups/public/com/davidsoergel/dsutils/1.05/dsutils-1.05-tests.jar (96 KB at 228.7 KB/sec)
Downloading: http://dev.davidsoergel.com/nexus/content/groups/public/commons-collections/commons-collections/3.2/commons-collections-3.2.jar
Downloaded: http://dev.davidsoergel.com/nexus/content/groups/public/edu/berkeley/compbio/ml/0.92/ml-0.92.jar (195 KB at 574.9 KB/sec)
Downloading: http://dev.davidsoergel.com/nexus/content/groups/public/org/easymock/easymock/2.0/easymock-2.0.jar
Downloaded: http://dev.davidsoergel.com/nexus/content/groups/public/commons-collections/commons-collections/3.2/commons-collections-3.2.jar (558 KB at 2695.0 KB/sec)
Downloading: http://dev.davidsoergel.com/nexus/content/groups/public/org/testng/testng/5.14.10/testng-5.14.10.jar
Downloaded: http://dev.davidsoergel.com/nexus/content/groups/public/com/davidsoergel/trees/1.03/trees-1.03.jar (83 KB at 203.2 KB/sec)
Downloading: http://dev.davidsoergel.com/nexus/content/groups/public/junit/junit/3.8.1/junit-3.8.1.jar
Downloaded: http://dev.davidsoergel.com/nexus/content/groups/public/org/easymock/easymock/2.0/easymock-2.0.jar (59 KB at 241.7 KB/sec)
Downloading: http://dev.davidsoergel.com/nexus/content/groups/public/org/beanshell/bsh/2.0b4/bsh-2.0b4.jar
Downloaded: http://dev.davidsoergel.com/nexus/content/groups/public/com/martiansoftware/JSAP/2.0a-ds1/JSAP-2.0a-ds1.jar (68 KB at 217.7 KB/sec)
Downloading: http://dev.davidsoergel.com/nexus/content/groups/public/com/beust/jcommander/1.12/jcommander-1.12.jar
Downloaded: http://dev.davidsoergel.com/nexus/content/groups/public/com/davidsoergel/runutils/0.91/runutils-0.91.jar (40 KB at 49.7 KB/sec)
Downloading: http://dev.davidsoergel.com/nexus/content/groups/public/org/yaml/snakeyaml/1.6/snakeyaml-1.6.jar
Downloaded: http://dev.davidsoergel.com/nexus/content/groups/public/org/beanshell/bsh/2.0b4/bsh-2.0b4.jar (276 KB at 619.6 KB/sec)
Downloading: http://dev.davidsoergel.com/nexus/content/groups/public/org/slf4j/slf4j-log4j12/1.6.4/slf4j-log4j12-1.6.4.jar
Downloaded: http://dev.davidsoergel.com/nexus/content/groups/public/junit/junit/3.8.1/junit-3.8.1.jar (119 KB at 188.3 KB/sec)
Downloaded: http://dev.davidsoergel.com/nexus/content/groups/public/org/slf4j/slf4j-log4j12/1.6.4/slf4j-log4j12-1.6.4.jar (10 KB at 71.0 KB/sec)
Downloading: http://dev.davidsoergel.com/nexus/content/groups/public/org/slf4j/slf4j-api/1.6.4/slf4j-api-1.6.4.jar
Downloading: http://dev.davidsoergel.com/nexus/content/groups/public/log4j/log4j/1.2.16/log4j-1.2.16.jar
Downloaded: http://dev.davidsoergel.com/nexus/content/groups/public/com/beust/jcommander/1.12/jcommander-1.12.jar (31 KB at 48.6 KB/sec)
Downloading: http://dev.davidsoergel.com/nexus/content/groups/public/com/intellij/annotations/7.0.3/annotations-7.0.3.jar
Downloaded: http://dev.davidsoergel.com/nexus/content/groups/public/org/testng/testng/5.14.10/testng-5.14.10.jar (559 KB at 796.9 KB/sec)
Downloaded: http://dev.davidsoergel.com/nexus/content/groups/public/org/yaml/snakeyaml/1.6/snakeyaml-1.6.jar (227 KB at 753.1 KB/sec)
Downloaded: http://dev.davidsoergel.com/nexus/content/groups/public/org/slf4j/slf4j-api/1.6.4/slf4j-api-1.6.4.jar (26 KB at 163.6 KB/sec)
Downloaded: http://dev.davidsoergel.com/nexus/content/groups/public/com/intellij/annotations/7.0.3/annotations-7.0.3.jar (6 KB at 47.5 KB/sec)
Downloaded: http://dev.davidsoergel.com/nexus/content/groups/public/log4j/log4j/1.2.16/log4j-1.2.16.jar (471 KB at 2501.3 KB/sec)
[INFO] Downloading: http://dev.davidsoergel.com/nexus/content/groups/public/org/apache/maven/maven-plugin-api/2.0.6/maven-plugin-api-2.0.6.pom

[INFO] --- maven-clean-plugin:2.4.1:clean (default-clean) @ sequtils ---
Downloaded: http://dev.davidsoergel.com/nexus/content/groups/public/org/apache/maven/maven-plugin-api/2.0.6/maven-plugin-api-2.0.6.pom (2 KB at 38.4 KB/sec)
Downloading: http://dev.davidsoergel.com/nexus/content/groups/public/org/apache/maven/maven/2.0.6/maven-2.0.6.pom
Downloaded: http://dev.davidsoergel.com/nexus/content/groups/public/org/apache/maven/maven/2.0.6/maven-2.0.6.pom (9 KB at 106.4 KB/sec)
Downloading: http://dev.davidsoergel.com/nexus/content/groups/public/org/apache/maven/maven-parent/5/maven-parent-5.pom
Downloaded: http://dev.davidsoergel.com/nexus/content/groups/public/org/apache/maven/maven-parent/5/maven-parent-5.pom (15 KB at 240.0 KB/sec)
Downloading: http://dev.davidsoergel.com/nexus/content/groups/public/org/codehaus/plexus/plexus-utils/2.0.5/plexus-utils-2.0.5.pom
Downloaded: http://dev.davidsoergel.com/nexus/content/groups/public/org/codehaus/plexus/plexus-utils/2.0.5/plexus-utils-2.0.5.pom (4 KB at 67.8 KB/sec)
Downloading: http://dev.davidsoergel.com/nexus/content/groups/public/org/codehaus/plexus/plexus/2.0.6/plexus-2.0.6.pom
Downloaded: http://dev.davidsoergel.com/nexus/content/groups/public/org/codehaus/plexus/plexus/2.0.6/plexus-2.0.6.pom (17 KB at 442.4 KB/sec)
Downloading: http://dev.davidsoergel.com/nexus/content/groups/public/org/codehaus/plexus/plexus-utils/2.0.5/plexus-utils-2.0.5.jar
Downloaded: http://dev.davidsoergel.com/nexus/content/groups/public/org/codehaus/plexus/plexus-utils/2.0.5/plexus-utils-2.0.5.jar (218 KB at 4737.8 KB/sec)
[INFO] 
[INFO] --- cobertura-maven-plugin:2.5.1:clean (clean) @ sequtils ---
Downloading: http://dev.davidsoergel.com/nexus/content/groups/public/net/sourceforge/cobertura/cobertura/1.9.4.1/cobertura-1.9.4.1.pom
Downloaded: http://dev.davidsoergel.com/nexus/content/groups/public/net/sourceforge/cobertura/cobertura/1.9.4.1/cobertura-1.9.4.1.pom (2 KB at 10.4 KB/sec)
Downloading: http://dev.davidsoergel.com/nexus/content/groups/public/oro/oro/2.0.8/oro-2.0.8.pom
Downloaded: http://dev.davidsoergel.com/nexus/content/groups/public/oro/oro/2.0.8/oro-2.0.8.pom (140 B at 0.8 KB/sec)
Downloading: http://dev.davidsoergel.com/nexus/content/groups/public/asm/asm/3.0/asm-3.0.pom
Downloaded: http://dev.davidsoergel.com/nexus/content/groups/public/asm/asm/3.0/asm-3.0.pom (360 B at 4.2 KB/sec)
Downloading: http://dev.davidsoergel.com/nexus/content/groups/public/asm/asm-parent/3.0/asm-parent-3.0.pom
Downloaded: http://dev.davidsoergel.com/nexus/content/groups/public/asm/asm-parent/3.0/asm-parent-3.0.pom (3 KB at 19.3 KB/sec)
Downloading: http://dev.davidsoergel.com/nexus/content/groups/public/asm/asm-tree/3.0/asm-tree-3.0.pom
Downloaded: http://dev.davidsoergel.com/nexus/content/groups/public/asm/asm-tree/3.0/asm-tree-3.0.pom (499 B at 15.7 KB/sec)
Downloading: http://dev.davidsoergel.com/nexus/content/groups/public/log4j/log4j/1.2.9/log4j-1.2.9.pom
Downloaded: http://dev.davidsoergel.com/nexus/content/groups/public/log4j/log4j/1.2.9/log4j-1.2.9.pom (144 B at 0.8 KB/sec)
Downloading: http://dev.davidsoergel.com/nexus/content/groups/public/org/apache/ant/ant/1.7.0/ant-1.7.0.pom
Downloaded: http://dev.davidsoergel.com/nexus/content/groups/public/org/apache/ant/ant/1.7.0/ant-1.7.0.pom (10 KB at 69.1 KB/sec)
Downloading: http://dev.davidsoergel.com/nexus/content/groups/public/org/apache/ant/ant-parent/1.7.0/ant-parent-1.7.0.pom
Downloaded: http://dev.davidsoergel.com/nexus/content/groups/public/org/apache/ant/ant-parent/1.7.0/ant-parent-1.7.0.pom (5 KB at 115.6 KB/sec)
Downloading: http://dev.davidsoergel.com/nexus/content/groups/public/org/apache/ant/ant-launcher/1.7.0/ant-launcher-1.7.0.pom
Downloaded: http://dev.davidsoergel.com/nexus/content/groups/public/org/apache/ant/ant-launcher/1.7.0/ant-launcher-1.7.0.pom (3 KB at 23.0 KB/sec)
Downloading: http://dev.davidsoergel.com/nexus/content/groups/public/net/sourceforge/cobertura/cobertura-runtime/1.9.4.1/cobertura-runtime-1.9.4.1.pom
Downloaded: http://dev.davidsoergel.com/nexus/content/groups/public/net/sourceforge/cobertura/cobertura-runtime/1.9.4.1/cobertura-runtime-1.9.4.1.pom (2 KB at 9.9 KB/sec)
Downloading: http://dev.davidsoergel.com/nexus/content/groups/public/urbanophile/java-getopt/1.0.9/java-getopt-1.0.9.pom
Downloaded: http://dev.davidsoergel.com/nexus/content/groups/public/urbanophile/java-getopt/1.0.9/java-getopt-1.0.9.pom (157 B at 1.2 KB/sec)
Downloading: http://dev.davidsoergel.com/nexus/content/groups/public/org/apache/maven/maven-core/2.0.8/maven-core-2.0.8.pom
Downloaded: http://dev.davidsoergel.com/nexus/content/groups/public/org/apache/maven/maven-core/2.0.8/maven-core-2.0.8.pom (7 KB at 40.0 KB/sec)
Downloading: http://dev.davidsoergel.com/nexus/content/groups/public/org/apache/maven/maven/2.0.8/maven-2.0.8.pom
Downloaded: http://dev.davidsoergel.com/nexus/content/groups/public/org/apache/maven/maven/2.0.8/maven-2.0.8.pom (12 KB at 45.3 KB/sec)
Downloading: http://dev.davidsoergel.com/nexus/content/groups/public/org/apache/maven/maven-parent/6/maven-parent-6.pom
Downloaded: http://dev.davidsoergel.com/nexus/content/groups/public/org/apache/maven/maven-parent/6/maven-parent-6.pom (20 KB at 101.4 KB/sec)
Downloading: http://dev.davidsoergel.com/nexus/content/groups/public/org/apache/maven/maven-settings/2.0.8/maven-settings-2.0.8.pom
Downloaded: http://dev.davidsoergel.com/nexus/content/groups/public/org/apache/maven/maven-settings/2.0.8/maven-settings-2.0.8.pom (3 KB at 54.3 KB/sec)
Downloading: http://dev.davidsoergel.com/nexus/content/groups/public/org/apache/maven/maven-model/2.0.8/maven-model-2.0.8.pom
Downloaded: http://dev.davidsoergel.com/nexus/content/groups/public/org/apache/maven/maven-model/2.0.8/maven-model-2.0.8.pom (4 KB at 33.0 KB/sec)
Downloading: http://dev.davidsoergel.com/nexus/content/groups/public/org/codehaus/plexus/plexus-utils/1.4.6/plexus-utils-1.4.6.pom
Downloaded: http://dev.davidsoergel.com/nexus/content/groups/public/org/codehaus/plexus/plexus-utils/1.4.6/plexus-utils-1.4.6.pom (3 KB at 19.1 KB/sec)
Downloading: http://dev.davidsoergel.com/nexus/content/groups/public/org/codehaus/plexus/plexus-container-default/1.0-alpha-9-stable-1/plexus-container-default-1.0-alpha-9-stable-1.pom
Downloaded: http://dev.davidsoergel.com/nexus/content/groups/public/org/codehaus/plexus/plexus-container-default/1.0-alpha-9-stable-1/plexus-container-default-1.0-alpha-9-stable-1.pom (4 KB at 83.8 KB/sec)
Downloading: http://dev.davidsoergel.com/nexus/content/groups/public/org/codehaus/plexus/plexus-containers/1.0.3/plexus-containers-1.0.3.pom
Downloaded: http://dev.davidsoergel.com/nexus/content/groups/public/org/codehaus/plexus/plexus-containers/1.0.3/plexus-containers-1.0.3.pom (492 B at 11.2 KB/sec)
Downloading: http://dev.davidsoergel.com/nexus/content/groups/public/org/codehaus/plexus/plexus/1.0.4/plexus-1.0.4.pom
Downloaded: http://dev.davidsoergel.com/nexus/content/groups/public/org/codehaus/plexus/plexus/1.0.4/plexus-1.0.4.pom (6 KB at 23.4 KB/sec)
Downloading: http://dev.davidsoergel.com/nexus/content/groups/public/junit/junit/3.8.2/junit-3.8.2.pom
Downloaded: http://dev.davidsoergel.com/nexus/content/groups/public/junit/junit/3.8.2/junit-3.8.2.pom (747 B at 5.8 KB/sec)
Downloading: http://dev.davidsoergel.com/nexus/content/groups/public/classworlds/classworlds/1.1-alpha-2/classworlds-1.1-alpha-2.pom
Downloaded: http://dev.davidsoergel.com/nexus/content/groups/public/classworlds/classworlds/1.1-alpha-2/classworlds-1.1-alpha-2.pom (4 KB at 35.1 KB/sec)
Downloading: http://dev.davidsoergel.com/nexus/content/groups/public/org/apache/maven/maven-plugin-parameter-documenter/2.0.8/maven-plugin-parameter-documenter-2.0.8.pom
Downloaded: http://dev.davidsoergel.com/nexus/content/groups/public/org/apache/maven/maven-plugin-parameter-documenter/2.0.8/maven-plugin-parameter-documenter-2.0.8.pom (2 KB at 8.4 KB/sec)
Downloading: http://dev.davidsoergel.com/nexus/content/groups/public/org/apache/maven/reporting/maven-reporting-api/2.0.8/maven-reporting-api-2.0.8.pom
Downloaded: http://dev.davidsoergel.com/nexus/content/groups/public/org/apache/maven/reporting/maven-reporting-api/2.0.8/maven-reporting-api-2.0.8.pom (2 KB at 44.0 KB/sec)
Downloading: http://dev.davidsoergel.com/nexus/content/groups/public/org/apache/maven/reporting/maven-reporting/2.0.8/maven-reporting-2.0.8.pom
Downloaded: http://dev.davidsoergel.com/nexus/content/groups/public/org/apache/maven/reporting/maven-reporting/2.0.8/maven-reporting-2.0.8.pom (2 KB at 53.4 KB/sec)
Downloading: http://dev.davidsoergel.com/nexus/content/groups/public/org/apache/maven/doxia/doxia-sink-api/1.0-alpha-9/doxia-sink-api-1.0-alpha-9.pom
Downloaded: http://dev.davidsoergel.com/nexus/content/groups/public/org/apache/maven/doxia/doxia-sink-api/1.0-alpha-9/doxia-sink-api-1.0-alpha-9.pom (2 KB at 10.1 KB/sec)
Downloading: http://dev.davidsoergel.com/nexus/content/groups/public/org/apache/maven/doxia/doxia/1.0-alpha-9/doxia-1.0-alpha-9.pom
Downloaded: http://dev.davidsoergel.com/nexus/content/groups/public/org/apache/maven/doxia/doxia/1.0-alpha-9/doxia-1.0-alpha-9.pom (9 KB at 162.6 KB/sec)
Downloading: http://dev.davidsoergel.com/nexus/content/groups/public/org/apache/maven/maven-profile/2.0.8/maven-profile-2.0.8.pom
Downloaded: http://dev.davidsoergel.com/nexus/content/groups/public/org/apache/maven/maven-profile/2.0.8/maven-profile-2.0.8.pom (2 KB at 34.9 KB/sec)
Downloading: http://dev.davidsoergel.com/nexus/content/groups/public/org/apache/maven/maven-artifact/2.0.8/maven-artifact-2.0.8.pom
Downloaded: http://dev.davidsoergel.com/nexus/content/groups/public/org/apache/maven/maven-artifact/2.0.8/maven-artifact-2.0.8.pom (2 KB at 27.3 KB/sec)
Downloading: http://dev.davidsoergel.com/nexus/content/groups/public/org/apache/maven/maven-repository-metadata/2.0.8/maven-repository-metadata-2.0.8.pom
Downloaded: http://dev.davidsoergel.com/nexus/content/groups/public/org/apache/maven/maven-repository-metadata/2.0.8/maven-repository-metadata-2.0.8.pom (2 KB at 44.2 KB/sec)
Downloading: http://dev.davidsoergel.com/nexus/content/groups/public/org/apache/maven/maven-error-diagnostics/2.0.8/maven-error-diagnostics-2.0.8.pom
Downloaded: http://dev.davidsoergel.com/nexus/content/groups/public/org/apache/maven/maven-error-diagnostics/2.0.8/maven-error-diagnostics-2.0.8.pom (2 KB at 43.7 KB/sec)
Downloading: http://dev.davidsoergel.com/nexus/content/groups/public/org/apache/maven/maven-project/2.0.8/maven-project-2.0.8.pom
Downloaded: http://dev.davidsoergel.com/nexus/content/groups/public/org/apache/maven/maven-project/2.0.8/maven-project-2.0.8.pom (3 KB at 91.3 KB/sec)
Downloading: http://dev.davidsoergel.com/nexus/content/groups/public/org/apache/maven/maven-artifact-manager/2.0.8/maven-artifact-manager-2.0.8.pom
Downloaded: http://dev.davidsoergel.com/nexus/content/groups/public/org/apache/maven/maven-artifact-manager/2.0.8/maven-artifact-manager-2.0.8.pom (3 KB at 90.9 KB/sec)
Downloading: http://dev.davidsoergel.com/nexus/content/groups/public/org/apache/maven/maven-plugin-registry/2.0.8/maven-plugin-registry-2.0.8.pom
Downloaded: http://dev.davidsoergel.com/nexus/content/groups/public/org/apache/maven/maven-plugin-registry/2.0.8/maven-plugin-registry-2.0.8.pom (2 KB at 40.7 KB/sec)
Downloading: http://dev.davidsoergel.com/nexus/content/groups/public/commons-cli/commons-cli/1.0/commons-cli-1.0.pom
Downloaded: http://dev.davidsoergel.com/nexus/content/groups/public/commons-cli/commons-cli/1.0/commons-cli-1.0.pom (3 KB at 31.1 KB/sec)
Downloading: http://dev.davidsoergel.com/nexus/content/groups/public/org/apache/maven/maven-plugin-api/2.0/maven-plugin-api-2.0.pom
Downloaded: http://dev.davidsoergel.com/nexus/content/groups/public/org/apache/maven/maven-plugin-api/2.0/maven-plugin-api-2.0.pom (601 B at 21.0 KB/sec)
Downloading: http://dev.davidsoergel.com/nexus/content/groups/public/org/apache/maven/maven/2.0/maven-2.0.pom
Downloaded: http://dev.davidsoergel.com/nexus/content/groups/public/org/apache/maven/maven/2.0/maven-2.0.pom (9 KB at 251.8 KB/sec)
Downloading: http://dev.davidsoergel.com/nexus/content/groups/public/org/apache/maven/maven-plugin-descriptor/2.0.8/maven-plugin-descriptor-2.0.8.pom
Downloaded: http://dev.davidsoergel.com/nexus/content/groups/public/org/apache/maven/maven-plugin-descriptor/2.0.8/maven-plugin-descriptor-2.0.8.pom (3 KB at 23.3 KB/sec)
Downloading: http://dev.davidsoergel.com/nexus/content/groups/public/org/codehaus/plexus/plexus-interactivity-api/1.0-alpha-4/plexus-interactivity-api-1.0-alpha-4.pom
Downloaded: http://dev.davidsoergel.com/nexus/content/groups/public/org/codehaus/plexus/plexus-interactivity-api/1.0-alpha-4/plexus-interactivity-api-1.0-alpha-4.pom (7 KB at 247.3 KB/sec)
Downloading: http://dev.davidsoergel.com/nexus/content/groups/public/org/apache/maven/maven-monitor/2.0.8/maven-monitor-2.0.8.pom
Downloaded: http://dev.davidsoergel.com/nexus/content/groups/public/org/apache/maven/maven-monitor/2.0.8/maven-monitor-2.0.8.pom (2 KB at 29.2 KB/sec)
Downloading: http://dev.davidsoergel.com/nexus/content/groups/public/classworlds/classworlds/1.1/classworlds-1.1.pom
Downloaded: http://dev.davidsoergel.com/nexus/content/groups/public/classworlds/classworlds/1.1/classworlds-1.1.pom (4 KB at 43.3 KB/sec)
Downloading: http://dev.davidsoergel.com/nexus/content/groups/public/org/apache/maven/maven-plugin-api/2.0.8/maven-plugin-api-2.0.8.pom
Downloaded: http://dev.davidsoergel.com/nexus/content/groups/public/org/apache/maven/maven-plugin-api/2.0.8/maven-plugin-api-2.0.8.pom (2 KB at 52.1 KB/sec)
Downloading: http://dev.davidsoergel.com/nexus/content/groups/public/org/apache/maven/reporting/maven-reporting-impl/2.0.4.2/maven-reporting-impl-2.0.4.2.pom
Downloaded: http://dev.davidsoergel.com/nexus/content/groups/public/org/apache/maven/reporting/maven-reporting-impl/2.0.4.2/maven-reporting-impl-2.0.4.2.pom (6 KB at 187.3 KB/sec)
Downloading: http://dev.davidsoergel.com/nexus/content/groups/public/org/apache/maven/shared/maven-shared-components/11/maven-shared-components-11.pom
Downloaded: http://dev.davidsoergel.com/nexus/content/groups/public/org/apache/maven/shared/maven-shared-components/11/maven-shared-components-11.pom (9 KB at 271.5 KB/sec)
Downloading: http://dev.davidsoergel.com/nexus/content/groups/public/org/apache/maven/maven-parent/11/maven-parent-11.pom
Downloaded: http://dev.davidsoergel.com/nexus/content/groups/public/org/apache/maven/maven-parent/11/maven-parent-11.pom (32 KB at 555.3 KB/sec)
Downloading: http://dev.davidsoergel.com/nexus/content/groups/public/org/apache/apache/5/apache-5.pom
Downloaded: http://dev.davidsoergel.com/nexus/content/groups/public/org/apache/apache/5/apache-5.pom (5 KB at 105.3 KB/sec)
Downloading: http://dev.davidsoergel.com/nexus/content/groups/public/org/apache/maven/maven-project/2.0.4/maven-project-2.0.4.pom
Downloaded: http://dev.davidsoergel.com/nexus/content/groups/public/org/apache/maven/maven-project/2.0.4/maven-project-2.0.4.pom (2 KB at 52.9 KB/sec)
Downloading: http://dev.davidsoergel.com/nexus/content/groups/public/org/apache/maven/maven/2.0.4/maven-2.0.4.pom
Downloaded: http://dev.davidsoergel.com/nexus/content/groups/public/org/apache/maven/maven/2.0.4/maven-2.0.4.pom (12 KB at 411.4 KB/sec)
Downloading: http://dev.davidsoergel.com/nexus/content/groups/public/org/apache/maven/maven-settings/2.0.4/maven-settings-2.0.4.pom
Downloaded: http://dev.davidsoergel.com/nexus/content/groups/public/org/apache/maven/maven-settings/2.0.4/maven-settings-2.0.4.pom (2 KB at 54.8 KB/sec)
Downloading: http://dev.davidsoergel.com/nexus/content/groups/public/org/apache/maven/maven-model/2.0.4/maven-model-2.0.4.pom
Downloaded: http://dev.davidsoergel.com/nexus/content/groups/public/org/apache/maven/maven-model/2.0.4/maven-model-2.0.4.pom (3 KB at 91.3 KB/sec)
Downloading: http://dev.davidsoergel.com/nexus/content/groups/public/org/codehaus/plexus/plexus-utils/1.1/plexus-utils-1.1.pom
Downloaded: http://dev.davidsoergel.com/nexus/content/groups/public/org/codehaus/plexus/plexus-utils/1.1/plexus-utils-1.1.pom (767 B at 28.8 KB/sec)
Downloading: http://dev.davidsoergel.com/nexus/content/groups/public/org/codehaus/plexus/plexus-container-default/1.0-alpha-9/plexus-container-default-1.0-alpha-9.pom
Downloaded: http://dev.davidsoergel.com/nexus/content/groups/public/org/codehaus/plexus/plexus-container-default/1.0-alpha-9/plexus-container-default-1.0-alpha-9.pom (2 KB at 30.9 KB/sec)
Downloading: http://dev.davidsoergel.com/nexus/content/groups/public/org/apache/maven/maven-profile/2.0.4/maven-profile-2.0.4.pom
Downloaded: http://dev.davidsoergel.com/nexus/content/groups/public/org/apache/maven/maven-profile/2.0.4/maven-profile-2.0.4.pom (2 KB at 60.8 KB/sec)
Downloading: http://dev.davidsoergel.com/nexus/content/groups/public/org/apache/maven/maven-artifact-manager/2.0.4/maven-artifact-manager-2.0.4.pom
Downloaded: http://dev.davidsoergel.com/nexus/content/groups/public/org/apache/maven/maven-artifact-manager/2.0.4/maven-artifact-manager-2.0.4.pom (2 KB at 21.4 KB/sec)
Downloading: http://dev.davidsoergel.com/nexus/content/groups/public/org/apache/maven/maven-repository-metadata/2.0.4/maven-repository-metadata-2.0.4.pom
Downloaded: http://dev.davidsoergel.com/nexus/content/groups/public/org/apache/maven/maven-repository-metadata/2.0.4/maven-repository-metadata-2.0.4.pom (2 KB at 30.9 KB/sec)
Downloading: http://dev.davidsoergel.com/nexus/content/groups/public/org/apache/maven/maven-artifact/2.0.4/maven-artifact-2.0.4.pom
Downloaded: http://dev.davidsoergel.com/nexus/content/groups/public/org/apache/maven/maven-artifact/2.0.4/maven-artifact-2.0.4.pom (765 B at 15.6 KB/sec)
Downloading: http://dev.davidsoergel.com/nexus/content/groups/public/commons-validator/commons-validator/1.2.0/commons-validator-1.2.0.pom
Downloaded: http://dev.davidsoergel.com/nexus/content/groups/public/commons-validator/commons-validator/1.2.0/commons-validator-1.2.0.pom (9 KB at 184.8 KB/sec)
Downloading: http://dev.davidsoergel.com/nexus/content/groups/public/commons-beanutils/commons-beanutils/1.7.0/commons-beanutils-1.7.0.pom
Downloaded: http://dev.davidsoergel.com/nexus/content/groups/public/commons-beanutils/commons-beanutils/1.7.0/commons-beanutils-1.7.0.pom (357 B at 8.3 KB/sec)
Downloading: http://dev.davidsoergel.com/nexus/content/groups/public/commons-digester/commons-digester/1.6/commons-digester-1.6.pom
Downloaded: http://dev.davidsoergel.com/nexus/content/groups/public/commons-digester/commons-digester/1.6/commons-digester-1.6.pom (974 B at 29.7 KB/sec)
Downloading: http://dev.davidsoergel.com/nexus/content/groups/public/commons-beanutils/commons-beanutils/1.6/commons-beanutils-1.6.pom
Downloaded: http://dev.davidsoergel.com/nexus/content/groups/public/commons-beanutils/commons-beanutils/1.6/commons-beanutils-1.6.pom (3 KB at 75.2 KB/sec)
Downloading: http://dev.davidsoergel.com/nexus/content/groups/public/commons-logging/commons-logging/1.0/commons-logging-1.0.pom
Downloaded: http://dev.davidsoergel.com/nexus/content/groups/public/commons-logging/commons-logging/1.0/commons-logging-1.0.pom (163 B at 5.0 KB/sec)
Downloading: http://dev.davidsoergel.com/nexus/content/groups/public/commons-collections/commons-collections/2.0/commons-collections-2.0.pom
Downloaded: http://dev.davidsoergel.com/nexus/content/groups/public/commons-collections/commons-collections/2.0/commons-collections-2.0.pom (171 B at 5.6 KB/sec)
Downloading: http://dev.davidsoergel.com/nexus/content/groups/public/commons-collections/commons-collections/2.1/commons-collections-2.1.pom
Downloaded: http://dev.davidsoergel.com/nexus/content/groups/public/commons-collections/commons-collections/2.1/commons-collections-2.1.pom (4 KB at 125.3 KB/sec)
Downloading: http://dev.davidsoergel.com/nexus/content/groups/public/xml-apis/xml-apis/1.0.b2/xml-apis-1.0.b2.pom
Downloaded: http://dev.davidsoergel.com/nexus/content/groups/public/xml-apis/xml-apis/1.0.b2/xml-apis-1.0.b2.pom (3 KB at 37.2 KB/sec)
Downloading: http://dev.davidsoergel.com/nexus/content/groups/public/xml-apis/xml-apis/2.0.2/xml-apis-2.0.2.pom
Downloaded: http://dev.davidsoergel.com/nexus/content/groups/public/xml-apis/xml-apis/2.0.2/xml-apis-2.0.2.pom (346 B at 12.5 KB/sec)
Downloading: http://dev.davidsoergel.com/nexus/content/groups/public/org/apache/maven/doxia/doxia-core/1.0/doxia-core-1.0.pom
Downloaded: http://dev.davidsoergel.com/nexus/content/groups/public/org/apache/maven/doxia/doxia-core/1.0/doxia-core-1.0.pom (3 KB at 80.7 KB/sec)
Downloading: http://dev.davidsoergel.com/nexus/content/groups/public/org/apache/maven/doxia/doxia/1.0/doxia-1.0.pom
Downloaded: http://dev.davidsoergel.com/nexus/content/groups/public/org/apache/maven/doxia/doxia/1.0/doxia-1.0.pom (10 KB at 224.2 KB/sec)
Downloading: http://dev.davidsoergel.com/nexus/content/groups/public/org/apache/maven/maven-parent/10/maven-parent-10.pom
Downloaded: http://dev.davidsoergel.com/nexus/content/groups/public/org/apache/maven/maven-parent/10/maven-parent-10.pom (31 KB at 1029.8 KB/sec)
Downloading: http://dev.davidsoergel.com/nexus/content/groups/public/org/apache/maven/doxia/doxia-sink-api/1.0/doxia-sink-api-1.0.pom
Downloaded: http://dev.davidsoergel.com/nexus/content/groups/public/org/apache/maven/doxia/doxia-sink-api/1.0/doxia-sink-api-1.0.pom (2 KB at 48.4 KB/sec)
Downloading: http://dev.davidsoergel.com/nexus/content/groups/public/org/codehaus/plexus/plexus-utils/1.5.7/plexus-utils-1.5.7.pom
Downloaded: http://dev.davidsoergel.com/nexus/content/groups/public/org/codehaus/plexus/plexus-utils/1.5.7/plexus-utils-1.5.7.pom (8 KB at 179.0 KB/sec)
Downloading: http://dev.davidsoergel.com/nexus/content/groups/public/org/codehaus/plexus/plexus/2.0.2/plexus-2.0.2.pom
Downloaded: http://dev.davidsoergel.com/nexus/content/groups/public/org/codehaus/plexus/plexus/2.0.2/plexus-2.0.2.pom (12 KB at 78.2 KB/sec)
Downloading: http://dev.davidsoergel.com/nexus/content/groups/public/org/codehaus/plexus/plexus-container-default/1.0-alpha-30/plexus-container-default-1.0-alpha-30.pom
Downloaded: http://dev.davidsoergel.com/nexus/content/groups/public/org/codehaus/plexus/plexus-container-default/1.0-alpha-30/plexus-container-default-1.0-alpha-30.pom (4 KB at 15.2 KB/sec)
Downloading: http://dev.davidsoergel.com/nexus/content/groups/public/org/codehaus/plexus/plexus-containers/1.0-alpha-30/plexus-containers-1.0-alpha-30.pom
Downloaded: http://dev.davidsoergel.com/nexus/content/groups/public/org/codehaus/plexus/plexus-containers/1.0-alpha-30/plexus-containers-1.0-alpha-30.pom (2 KB at 57.8 KB/sec)
Downloading: http://dev.davidsoergel.com/nexus/content/groups/public/org/codehaus/plexus/plexus-utils/1.4.5/plexus-utils-1.4.5.pom
Downloaded: http://dev.davidsoergel.com/nexus/content/groups/public/org/codehaus/plexus/plexus-utils/1.4.5/plexus-utils-1.4.5.pom (3 KB at 15.7 KB/sec)
Downloading: http://dev.davidsoergel.com/nexus/content/groups/public/org/codehaus/plexus/plexus-classworlds/1.2-alpha-9/plexus-classworlds-1.2-alpha-9.pom
Downloaded: http://dev.davidsoergel.com/nexus/content/groups/public/org/codehaus/plexus/plexus-classworlds/1.2-alpha-9/plexus-classworlds-1.2-alpha-9.pom (4 KB at 125.9 KB/sec)
Downloading: http://dev.davidsoergel.com/nexus/content/groups/public/org/apache/maven/reporting/maven-reporting-api/2.0.4/maven-reporting-api-2.0.4.pom
Downloaded: http://dev.davidsoergel.com/nexus/content/groups/public/org/apache/maven/reporting/maven-reporting-api/2.0.4/maven-reporting-api-2.0.4.pom (902 B at 21.0 KB/sec)
Downloading: http://dev.davidsoergel.com/nexus/content/groups/public/org/apache/maven/reporting/maven-reporting/2.0.4/maven-reporting-2.0.4.pom
Downloaded: http://dev.davidsoergel.com/nexus/content/groups/public/org/apache/maven/reporting/maven-reporting/2.0.4/maven-reporting-2.0.4.pom (700 B at 10.5 KB/sec)
Downloading: http://dev.davidsoergel.com/nexus/content/groups/public/org/apache/maven/doxia/doxia-sink-api/1.0-alpha-7/doxia-sink-api-1.0-alpha-7.pom
Downloaded: http://dev.davidsoergel.com/nexus/content/groups/public/org/apache/maven/doxia/doxia-sink-api/1.0-alpha-7/doxia-sink-api-1.0-alpha-7.pom (424 B at 9.9 KB/sec)
Downloading: http://dev.davidsoergel.com/nexus/content/groups/public/org/apache/maven/doxia/doxia/1.0-alpha-7/doxia-1.0-alpha-7.pom
Downloaded: http://dev.davidsoergel.com/nexus/content/groups/public/org/apache/maven/doxia/doxia/1.0-alpha-7/doxia-1.0-alpha-7.pom (4 KB at 147.0 KB/sec)
Downloading: http://dev.davidsoergel.com/nexus/content/groups/public/org/apache/maven/doxia/doxia-site-renderer/1.0/doxia-site-renderer-1.0.pom
Downloaded: http://dev.davidsoergel.com/nexus/content/groups/public/org/apache/maven/doxia/doxia-site-renderer/1.0/doxia-site-renderer-1.0.pom (5 KB at 83.1 KB/sec)
Downloading: http://dev.davidsoergel.com/nexus/content/groups/public/org/apache/maven/doxia/doxia-sitetools/1.0/doxia-sitetools-1.0.pom
Downloaded: http://dev.davidsoergel.com/nexus/content/groups/public/org/apache/maven/doxia/doxia-sitetools/1.0/doxia-sitetools-1.0.pom (10 KB at 212.8 KB/sec)
Downloading: http://dev.davidsoergel.com/nexus/content/groups/public/org/codehaus/plexus/plexus-i18n/1.0-beta-7/plexus-i18n-1.0-beta-7.pom
Downloaded: http://dev.davidsoergel.com/nexus/content/groups/public/org/codehaus/plexus/plexus-i18n/1.0-beta-7/plexus-i18n-1.0-beta-7.pom (2 KB at 15.2 KB/sec)
Downloading: http://dev.davidsoergel.com/nexus/content/groups/public/org/codehaus/plexus/plexus-components/1.1.12/plexus-components-1.1.12.pom
Downloaded: http://dev.davidsoergel.com/nexus/content/groups/public/org/codehaus/plexus/plexus-components/1.1.12/plexus-components-1.1.12.pom (3 KB at 117.3 KB/sec)
Downloading: http://dev.davidsoergel.com/nexus/content/groups/public/org/codehaus/plexus/plexus-utils/1.4.1/plexus-utils-1.4.1.pom
Downloaded: http://dev.davidsoergel.com/nexus/content/groups/public/org/codehaus/plexus/plexus-utils/1.4.1/plexus-utils-1.4.1.pom (2 KB at 40.5 KB/sec)
Downloading: http://dev.davidsoergel.com/nexus/content/groups/public/org/codehaus/plexus/plexus-velocity/1.1.7/plexus-velocity-1.1.7.pom
Downloaded: http://dev.davidsoergel.com/nexus/content/groups/public/org/codehaus/plexus/plexus-velocity/1.1.7/plexus-velocity-1.1.7.pom (2 KB at 68.3 KB/sec)
Downloading: http://dev.davidsoergel.com/nexus/content/groups/public/org/codehaus/plexus/plexus-container-default/1.0-alpha-20/plexus-container-default-1.0-alpha-20.pom
Downloaded: http://dev.davidsoergel.com/nexus/content/groups/public/org/codehaus/plexus/plexus-container-default/1.0-alpha-20/plexus-container-default-1.0-alpha-20.pom (3 KB at 108.2 KB/sec)
Downloading: http://dev.davidsoergel.com/nexus/content/groups/public/org/codehaus/plexus/plexus-containers/1.0-alpha-20/plexus-containers-1.0-alpha-20.pom
Downloaded: http://dev.davidsoergel.com/nexus/content/groups/public/org/codehaus/plexus/plexus-containers/1.0-alpha-20/plexus-containers-1.0-alpha-20.pom (2 KB at 19.4 KB/sec)
Downloading: http://dev.davidsoergel.com/nexus/content/groups/public/org/codehaus/plexus/plexus-utils/1.3/plexus-utils-1.3.pom
Downloaded: http://dev.davidsoergel.com/nexus/content/groups/public/org/codehaus/plexus/plexus-utils/1.3/plexus-utils-1.3.pom (2 KB at 12.2 KB/sec)
Downloading: http://dev.davidsoergel.com/nexus/content/groups/public/org/codehaus/plexus/plexus/1.0.8/plexus-1.0.8.pom
Downloaded: http://dev.davidsoergel.com/nexus/content/groups/public/org/codehaus/plexus/plexus/1.0.8/plexus-1.0.8.pom (8 KB at 138.4 KB/sec)
Downloading: http://dev.davidsoergel.com/nexus/content/groups/public/org/codehaus/plexus/plexus-classworlds/1.2-alpha-7/plexus-classworlds-1.2-alpha-7.pom
Downloaded: http://dev.davidsoergel.com/nexus/content/groups/public/org/codehaus/plexus/plexus-classworlds/1.2-alpha-7/plexus-classworlds-1.2-alpha-7.pom (3 KB at 79.9 KB/sec)
Downloading: http://dev.davidsoergel.com/nexus/content/groups/public/org/codehaus/plexus/plexus/1.0.9/plexus-1.0.9.pom
Downloaded: http://dev.davidsoergel.com/nexus/content/groups/public/org/codehaus/plexus/plexus/1.0.9/plexus-1.0.9.pom (8 KB at 153.1 KB/sec)
Downloading: http://dev.davidsoergel.com/nexus/content/groups/public/org/apache/velocity/velocity/1.5/velocity-1.5.pom
Downloaded: http://dev.davidsoergel.com/nexus/content/groups/public/org/apache/velocity/velocity/1.5/velocity-1.5.pom (8 KB at 109.9 KB/sec)
Downloading: http://dev.davidsoergel.com/nexus/content/groups/public/commons-collections/commons-collections/3.1/commons-collections-3.1.pom
Downloaded: http://dev.davidsoergel.com/nexus/content/groups/public/commons-collections/commons-collections/3.1/commons-collections-3.1.pom (6 KB at 71.6 KB/sec)
Downloading: http://dev.davidsoergel.com/nexus/content/groups/public/commons-lang/commons-lang/2.1/commons-lang-2.1.pom
Downloaded: http://dev.davidsoergel.com/nexus/content/groups/public/commons-lang/commons-lang/2.1/commons-lang-2.1.pom (10 KB at 140.5 KB/sec)
Downloading: http://dev.davidsoergel.com/nexus/content/groups/public/org/apache/maven/doxia/doxia-decoration-model/1.0/doxia-decoration-model-1.0.pom
Downloaded: http://dev.davidsoergel.com/nexus/content/groups/public/org/apache/maven/doxia/doxia-decoration-model/1.0/doxia-decoration-model-1.0.pom (4 KB at 43.4 KB/sec)
Downloading: http://dev.davidsoergel.com/nexus/content/groups/public/org/apache/maven/doxia/doxia-module-apt/1.0/doxia-module-apt-1.0.pom
Downloaded: http://dev.davidsoergel.com/nexus/content/groups/public/org/apache/maven/doxia/doxia-module-apt/1.0/doxia-module-apt-1.0.pom (3 KB at 39.3 KB/sec)
Downloading: http://dev.davidsoergel.com/nexus/content/groups/public/org/apache/maven/doxia/doxia-modules/1.0/doxia-modules-1.0.pom
Downloaded: http://dev.davidsoergel.com/nexus/content/groups/public/org/apache/maven/doxia/doxia-modules/1.0/doxia-modules-1.0.pom (3 KB at 43.3 KB/sec)
Downloading: http://dev.davidsoergel.com/nexus/content/groups/public/org/apache/maven/doxia/doxia-module-fml/1.0/doxia-module-fml-1.0.pom
Downloaded: http://dev.davidsoergel.com/nexus/content/groups/public/org/apache/maven/doxia/doxia-module-fml/1.0/doxia-module-fml-1.0.pom (3 KB at 97.4 KB/sec)
Downloading: http://dev.davidsoergel.com/nexus/content/groups/public/org/apache/maven/doxia/doxia-module-xdoc/1.0/doxia-module-xdoc-1.0.pom
Downloaded: http://dev.davidsoergel.com/nexus/content/groups/public/org/apache/maven/doxia/doxia-module-xdoc/1.0/doxia-module-xdoc-1.0.pom (3 KB at 81.1 KB/sec)
Downloading: http://dev.davidsoergel.com/nexus/content/groups/public/org/apache/maven/doxia/doxia-module-xhtml/1.0/doxia-module-xhtml-1.0.pom
Downloaded: http://dev.davidsoergel.com/nexus/content/groups/public/org/apache/maven/doxia/doxia-module-xhtml/1.0/doxia-module-xhtml-1.0.pom (2 KB at 48.8 KB/sec)
Downloading: http://dev.davidsoergel.com/nexus/content/groups/public/commons-lang/commons-lang/2.4/commons-lang-2.4.pom
Downloaded: http://dev.davidsoergel.com/nexus/content/groups/public/commons-lang/commons-lang/2.4/commons-lang-2.4.pom (14 KB at 216.6 KB/sec)
Downloading: http://dev.davidsoergel.com/nexus/content/groups/public/org/apache/commons/commons-parent/9/commons-parent-9.pom
Downloaded: http://dev.davidsoergel.com/nexus/content/groups/public/org/apache/commons/commons-parent/9/commons-parent-9.pom (22 KB at 498.0 KB/sec)
Downloading: http://dev.davidsoergel.com/nexus/content/groups/public/org/codehaus/plexus/plexus-utils/2.0.2/plexus-utils-2.0.2.pom
Downloaded: http://dev.davidsoergel.com/nexus/content/groups/public/org/codehaus/plexus/plexus-utils/2.0.2/plexus-utils-2.0.2.pom (4 KB at 57.3 KB/sec)
Downloading: http://dev.davidsoergel.com/nexus/content/groups/public/org/apache/maven/shared/maven-invoker/2.0.11/maven-invoker-2.0.11.pom
Downloaded: http://dev.davidsoergel.com/nexus/content/groups/public/org/apache/maven/shared/maven-invoker/2.0.11/maven-invoker-2.0.11.pom (5 KB at 99.1 KB/sec)
Downloading: http://dev.davidsoergel.com/nexus/content/groups/public/org/apache/maven/shared/maven-shared-components/12/maven-shared-components-12.pom
Downloaded: http://dev.davidsoergel.com/nexus/content/groups/public/org/apache/maven/shared/maven-shared-components/12/maven-shared-components-12.pom (10 KB at 350.7 KB/sec)
Downloading: http://dev.davidsoergel.com/nexus/content/groups/public/org/apache/maven/maven-parent/13/maven-parent-13.pom
Downloaded: http://dev.davidsoergel.com/nexus/content/groups/public/org/apache/maven/maven-parent/13/maven-parent-13.pom (23 KB at 762.2 KB/sec)
Downloading: http://dev.davidsoergel.com/nexus/content/groups/public/org/codehaus/plexus/plexus-utils/1.5.6/plexus-utils-1.5.6.pom
Downloaded: http://dev.davidsoergel.com/nexus/content/groups/public/org/codehaus/plexus/plexus-utils/1.5.6/plexus-utils-1.5.6.pom (6 KB at 191.8 KB/sec)
Downloading: http://dev.davidsoergel.com/nexus/content/groups/public/org/codehaus/plexus/plexus/1.0.12/plexus-1.0.12.pom
Downloaded: http://dev.davidsoergel.com/nexus/content/groups/public/org/codehaus/plexus/plexus/1.0.12/plexus-1.0.12.pom (10 KB at 212.7 KB/sec)
Downloading: http://dev.davidsoergel.com/nexus/content/groups/public/net/sourceforge/cobertura/cobertura/1.9.4.1/cobertura-1.9.4.1.jar
Downloading: http://dev.davidsoergel.com/nexus/content/groups/public/oro/oro/2.0.8/oro-2.0.8.jar
Downloading: http://dev.davidsoergel.com/nexus/content/groups/public/asm/asm/3.0/asm-3.0.jar
Downloading: http://dev.davidsoergel.com/nexus/content/groups/public/log4j/log4j/1.2.9/log4j-1.2.9.jar
Downloading: http://dev.davidsoergel.com/nexus/content/groups/public/asm/asm-tree/3.0/asm-tree-3.0.jar
Downloaded: http://dev.davidsoergel.com/nexus/content/groups/public/asm/asm/3.0/asm-3.0.jar (42 KB at 156.8 KB/sec)
Downloading: http://dev.davidsoergel.com/nexus/content/groups/public/org/apache/ant/ant/1.7.0/ant-1.7.0.jar
Downloaded: http://dev.davidsoergel.com/nexus/content/groups/public/asm/asm-tree/3.0/asm-tree-3.0.jar (22 KB at 76.7 KB/sec)
Downloading: http://dev.davidsoergel.com/nexus/content/groups/public/org/apache/ant/ant-launcher/1.7.0/ant-launcher-1.7.0.jar
Downloaded: http://dev.davidsoergel.com/nexus/content/groups/public/oro/oro/2.0.8/oro-2.0.8.jar (64 KB at 213.1 KB/sec)
Downloading: http://dev.davidsoergel.com/nexus/content/groups/public/urbanophile/java-getopt/1.0.9/java-getopt-1.0.9.jar
Downloaded: http://dev.davidsoergel.com/nexus/content/groups/public/log4j/log4j/1.2.9/log4j-1.2.9.jar (345 KB at 1178.2 KB/sec)
Downloading: http://dev.davidsoergel.com/nexus/content/groups/public/commons-cli/commons-cli/1.0/commons-cli-1.0.jar
Downloaded: http://dev.davidsoergel.com/nexus/content/groups/public/net/sourceforge/cobertura/cobertura/1.9.4.1/cobertura-1.9.4.1.jar (443 KB at 1072.0 KB/sec)
Downloading: http://dev.davidsoergel.com/nexus/content/groups/public/org/codehaus/plexus/plexus-interactivity-api/1.0-alpha-4/plexus-interactivity-api-1.0-alpha-4.jar
Downloaded: http://dev.davidsoergel.com/nexus/content/groups/public/org/apache/ant/ant-launcher/1.7.0/ant-launcher-1.7.0.jar (12 KB at 63.7 KB/sec)
Downloading: http://dev.davidsoergel.com/nexus/content/groups/public/org/apache/maven/reporting/maven-reporting-api/2.0.8/maven-reporting-api-2.0.8.jar
Downloaded: http://dev.davidsoergel.com/nexus/content/groups/public/urbanophile/java-getopt/1.0.9/java-getopt-1.0.9.jar (53 KB at 289.1 KB/sec)
Downloading: http://dev.davidsoergel.com/nexus/content/groups/public/org/apache/maven/doxia/doxia-sink-api/1.0-alpha-9/doxia-sink-api-1.0-alpha-9.jar
Downloaded: http://dev.davidsoergel.com/nexus/content/groups/public/commons-cli/commons-cli/1.0/commons-cli-1.0.jar (30 KB at 168.1 KB/sec)
Downloading: http://dev.davidsoergel.com/nexus/content/groups/public/org/apache/maven/reporting/maven-reporting-impl/2.0.4.2/maven-reporting-impl-2.0.4.2.jar
Downloaded: http://dev.davidsoergel.com/nexus/content/groups/public/org/codehaus/plexus/plexus-interactivity-api/1.0-alpha-4/plexus-interactivity-api-1.0-alpha-4.jar (14 KB at 35.2 KB/sec)
Downloading: http://dev.davidsoergel.com/nexus/content/groups/public/commons-validator/commons-validator/1.2.0/commons-validator-1.2.0.jar
Downloaded: http://dev.davidsoergel.com/nexus/content/groups/public/org/apache/maven/doxia/doxia-sink-api/1.0-alpha-9/doxia-sink-api-1.0-alpha-9.jar (10 KB at 26.7 KB/sec)
Downloading: http://dev.davidsoergel.com/nexus/content/groups/public/commons-beanutils/commons-beanutils/1.7.0/commons-beanutils-1.7.0.jar
Downloaded: http://dev.davidsoergel.com/nexus/content/groups/public/org/apache/ant/ant/1.7.0/ant-1.7.0.jar (1260 KB at 1781.6 KB/sec)
Downloading: http://dev.davidsoergel.com/nexus/content/groups/public/commons-digester/commons-digester/1.6/commons-digester-1.6.jar
Downloaded: http://dev.davidsoergel.com/nexus/content/groups/public/commons-validator/commons-validator/1.2.0/commons-validator-1.2.0.jar (89 KB at 241.1 KB/sec)
Downloading: http://dev.davidsoergel.com/nexus/content/groups/public/xml-apis/xml-apis/1.0.b2/xml-apis-1.0.b2.jar
Downloaded: http://dev.davidsoergel.com/nexus/content/groups/public/org/apache/maven/reporting/maven-reporting-api/2.0.8/maven-reporting-api-2.0.8.jar (10 KB at 14.5 KB/sec)
Downloading: http://dev.davidsoergel.com/nexus/content/groups/public/org/apache/maven/doxia/doxia-core/1.0/doxia-core-1.0.jar
Downloaded: http://dev.davidsoergel.com/nexus/content/groups/public/commons-beanutils/commons-beanutils/1.7.0/commons-beanutils-1.7.0.jar (185 KB at 540.3 KB/sec)
Downloading: http://dev.davidsoergel.com/nexus/content/groups/public/org/apache/maven/doxia/doxia-site-renderer/1.0/doxia-site-renderer-1.0.jar
Downloaded: http://dev.davidsoergel.com/nexus/content/groups/public/commons-digester/commons-digester/1.6/commons-digester-1.6.jar (165 KB at 589.6 KB/sec)
Downloading: http://dev.davidsoergel.com/nexus/content/groups/public/org/codehaus/plexus/plexus-i18n/1.0-beta-7/plexus-i18n-1.0-beta-7.jar
Downloaded: http://dev.davidsoergel.com/nexus/content/groups/public/org/apache/maven/doxia/doxia-site-renderer/1.0/doxia-site-renderer-1.0.jar (46 KB at 339.0 KB/sec)
Downloaded: http://dev.davidsoergel.com/nexus/content/groups/public/xml-apis/xml-apis/1.0.b2/xml-apis-1.0.b2.jar (107 KB at 472.4 KB/sec)
Downloading: http://dev.davidsoergel.com/nexus/content/groups/public/org/codehaus/plexus/plexus-velocity/1.1.7/plexus-velocity-1.1.7.jar
Downloading: http://dev.davidsoergel.com/nexus/content/groups/public/org/apache/velocity/velocity/1.5/velocity-1.5.jar
Downloaded: http://dev.davidsoergel.com/nexus/content/groups/public/org/apache/maven/doxia/doxia-core/1.0/doxia-core-1.0.jar (54 KB at 232.3 KB/sec)
Downloading: http://dev.davidsoergel.com/nexus/content/groups/public/org/apache/maven/doxia/doxia-decoration-model/1.0/doxia-decoration-model-1.0.jar
Downloaded: http://dev.davidsoergel.com/nexus/content/groups/public/org/codehaus/plexus/plexus-velocity/1.1.7/plexus-velocity-1.1.7.jar (8 KB at 37.1 KB/sec)
Downloading: http://dev.davidsoergel.com/nexus/content/groups/public/org/apache/maven/doxia/doxia-module-apt/1.0/doxia-module-apt-1.0.jar
Downloaded: http://dev.davidsoergel.com/nexus/content/groups/public/org/apache/maven/doxia/doxia-decoration-model/1.0/doxia-decoration-model-1.0.jar (48 KB at 239.2 KB/sec)
Downloading: http://dev.davidsoergel.com/nexus/content/groups/public/org/apache/maven/doxia/doxia-module-fml/1.0/doxia-module-fml-1.0.jar
Downloaded: http://dev.davidsoergel.com/nexus/content/groups/public/org/apache/maven/doxia/doxia-module-fml/1.0/doxia-module-fml-1.0.jar (19 KB at 143.7 KB/sec)
Downloading: http://dev.davidsoergel.com/nexus/content/groups/public/org/apache/maven/doxia/doxia-module-xdoc/1.0/doxia-module-xdoc-1.0.jar
Downloaded: http://dev.davidsoergel.com/nexus/content/groups/public/org/codehaus/plexus/plexus-i18n/1.0-beta-7/plexus-i18n-1.0-beta-7.jar (11 KB at 20.9 KB/sec)
Downloading: http://dev.davidsoergel.com/nexus/content/groups/public/org/apache/maven/doxia/doxia-module-xhtml/1.0/doxia-module-xhtml-1.0.jar
Downloaded: http://dev.davidsoergel.com/nexus/content/groups/public/org/apache/velocity/velocity/1.5/velocity-1.5.jar (383 KB at 827.1 KB/sec)
Downloading: http://dev.davidsoergel.com/nexus/content/groups/public/commons-lang/commons-lang/2.4/commons-lang-2.4.jar
Downloaded: http://dev.davidsoergel.com/nexus/content/groups/public/org/apache/maven/doxia/doxia-module-xdoc/1.0/doxia-module-xdoc-1.0.jar (28 KB at 382.3 KB/sec)
Downloading: http://dev.davidsoergel.com/nexus/content/groups/public/org/codehaus/plexus/plexus-utils/2.0.2/plexus-utils-2.0.2.jar
Downloaded: http://dev.davidsoergel.com/nexus/content/groups/public/org/apache/maven/doxia/doxia-module-xhtml/1.0/doxia-module-xhtml-1.0.jar (22 KB at 145.8 KB/sec)
Downloading: http://dev.davidsoergel.com/nexus/content/groups/public/org/apache/maven/shared/maven-invoker/2.0.11/maven-invoker-2.0.11.jar
Downloaded: http://dev.davidsoergel.com/nexus/content/groups/public/org/codehaus/plexus/plexus-utils/2.0.2/plexus-utils-2.0.2.jar (218 KB at 742.1 KB/sec)
Downloaded: http://dev.davidsoergel.com/nexus/content/groups/public/org/apache/maven/shared/maven-invoker/2.0.11/maven-invoker-2.0.11.jar (29 KB at 138.4 KB/sec)
Downloaded: http://dev.davidsoergel.com/nexus/content/groups/public/commons-lang/commons-lang/2.4/commons-lang-2.4.jar (256 KB at 716.2 KB/sec)
Downloaded: http://dev.davidsoergel.com/nexus/content/groups/public/org/apache/maven/doxia/doxia-module-apt/1.0/doxia-module-apt-1.0.jar (46 KB at 41.6 KB/sec)
Downloaded: http://dev.davidsoergel.com/nexus/content/groups/public/org/apache/maven/reporting/maven-reporting-impl/2.0.4.2/maven-reporting-impl-2.0.4.2.jar (20 KB at 2.8 KB/sec)
Mar 20, 2013 2:18:21 PM hudson.maven.ExecutedMojo <init>
WARNING: Failed to getClass for org.apache.maven.plugin.source.SourceJarMojo
Downloading: http://dev.davidsoergel.com/nexus/content/groups/public/org/apache/maven/maven-model/2.0.9/maven-model-2.0.9.pom
[INFO] 
[INFO] --- maven-source-plugin:2.2.1:jar (default-cli) @ sequtils ---
Downloaded: http://dev.davidsoergel.com/nexus/content/groups/public/org/apache/maven/maven-model/2.0.9/maven-model-2.0.9.pom (4 KB at 11.5 KB/sec)
Downloading: http://dev.davidsoergel.com/nexus/content/groups/public/org/apache/maven/maven/2.0.9/maven-2.0.9.pom
Downloaded: http://dev.davidsoergel.com/nexus/content/groups/public/org/apache/maven/maven/2.0.9/maven-2.0.9.pom (19 KB at 73.3 KB/sec)
Downloading: http://dev.davidsoergel.com/nexus/content/groups/public/org/apache/maven/maven-parent/8/maven-parent-8.pom
Downloaded: http://dev.davidsoergel.com/nexus/content/groups/public/org/apache/maven/maven-parent/8/maven-parent-8.pom (24 KB at 167.1 KB/sec)
Downloading: http://dev.davidsoergel.com/nexus/content/groups/public/org/codehaus/plexus/plexus-utils/1.5.1/plexus-utils-1.5.1.pom
Downloaded: http://dev.davidsoergel.com/nexus/content/groups/public/org/codehaus/plexus/plexus-utils/1.5.1/plexus-utils-1.5.1.pom (3 KB at 18.1 KB/sec)
Downloading: http://dev.davidsoergel.com/nexus/content/groups/public/org/apache/maven/maven-artifact/2.0.9/maven-artifact-2.0.9.pom
Downloaded: http://dev.davidsoergel.com/nexus/content/groups/public/org/apache/maven/maven-artifact/2.0.9/maven-artifact-2.0.9.pom (2 KB at 25.5 KB/sec)
Downloading: http://dev.davidsoergel.com/nexus/content/groups/public/org/apache/maven/maven-plugin-api/2.0.9/maven-plugin-api-2.0.9.pom
Downloaded: http://dev.davidsoergel.com/nexus/content/groups/public/org/apache/maven/maven-plugin-api/2.0.9/maven-plugin-api-2.0.9.pom (2 KB at 14.3 KB/sec)
Downloading: http://dev.davidsoergel.com/nexus/content/groups/public/org/apache/maven/maven-project/2.0.9/maven-project-2.0.9.pom
Downloaded: http://dev.davidsoergel.com/nexus/content/groups/public/org/apache/maven/maven-project/2.0.9/maven-project-2.0.9.pom (3 KB at 7.8 KB/sec)
Downloading: http://dev.davidsoergel.com/nexus/content/groups/public/org/apache/maven/maven-settings/2.0.9/maven-settings-2.0.9.pom
Downloaded: http://dev.davidsoergel.com/nexus/content/groups/public/org/apache/maven/maven-settings/2.0.9/maven-settings-2.0.9.pom (3 KB at 9.6 KB/sec)
Downloading: http://dev.davidsoergel.com/nexus/content/groups/public/org/apache/maven/maven-profile/2.0.9/maven-profile-2.0.9.pom
Downloaded: http://dev.davidsoergel.com/nexus/content/groups/public/org/apache/maven/maven-profile/2.0.9/maven-profile-2.0.9.pom (3 KB at 7.6 KB/sec)
Downloading: http://dev.davidsoergel.com/nexus/content/groups/public/org/apache/maven/maven-artifact-manager/2.0.9/maven-artifact-manager-2.0.9.pom
Downloaded: http://dev.davidsoergel.com/nexus/content/groups/public/org/apache/maven/maven-artifact-manager/2.0.9/maven-artifact-manager-2.0.9.pom (3 KB at 7.0 KB/sec)
Downloading: http://dev.davidsoergel.com/nexus/content/groups/public/org/apache/maven/maven-repository-metadata/2.0.9/maven-repository-metadata-2.0.9.pom
Downloaded: http://dev.davidsoergel.com/nexus/content/groups/public/org/apache/maven/maven-repository-metadata/2.0.9/maven-repository-metadata-2.0.9.pom (2 KB at 8.3 KB/sec)
Downloading: http://dev.davidsoergel.com/nexus/content/groups/public/org/apache/maven/maven-plugin-registry/2.0.9/maven-plugin-registry-2.0.9.pom
Downloaded: http://dev.davidsoergel.com/nexus/content/groups/public/org/apache/maven/maven-plugin-registry/2.0.9/maven-plugin-registry-2.0.9.pom (2 KB at 10.9 KB/sec)
Downloading: http://dev.davidsoergel.com/nexus/content/groups/public/org/apache/maven/maven-archiver/2.5/maven-archiver-2.5.pom
Downloaded: http://dev.davidsoergel.com/nexus/content/groups/public/org/apache/maven/maven-archiver/2.5/maven-archiver-2.5.pom (5 KB at 29.0 KB/sec)
Downloading: http://dev.davidsoergel.com/nexus/content/groups/public/org/apache/maven/shared/maven-shared-components/17/maven-shared-components-17.pom
Downloaded: http://dev.davidsoergel.com/nexus/content/groups/public/org/apache/maven/shared/maven-shared-components/17/maven-shared-components-17.pom (9 KB at 177.0 KB/sec)
Downloading: http://dev.davidsoergel.com/nexus/content/groups/public/org/apache/maven/maven-artifact/2.0.6/maven-artifact-2.0.6.pom
Downloaded: http://dev.davidsoergel.com/nexus/content/groups/public/org/apache/maven/maven-artifact/2.0.6/maven-artifact-2.0.6.pom (2 KB at 5.4 KB/sec)
Downloading: http://dev.davidsoergel.com/nexus/content/groups/public/org/apache/maven/maven-model/2.0.6/maven-model-2.0.6.pom
Downloaded: http://dev.davidsoergel.com/nexus/content/groups/public/org/apache/maven/maven-model/2.0.6/maven-model-2.0.6.pom (3 KB at 106.3 KB/sec)
Downloading: http://dev.davidsoergel.com/nexus/content/groups/public/org/apache/maven/maven-core/2.0.6/maven-core-2.0.6.pom
Downloaded: http://dev.davidsoergel.com/nexus/content/groups/public/org/apache/maven/maven-core/2.0.6/maven-core-2.0.6.pom (7 KB at 23.7 KB/sec)
Downloading: http://dev.davidsoergel.com/nexus/content/groups/public/org/apache/maven/maven-settings/2.0.6/maven-settings-2.0.6.pom
Downloaded: http://dev.davidsoergel.com/nexus/content/groups/public/org/apache/maven/maven-settings/2.0.6/maven-settings-2.0.6.pom (2 KB at 63.0 KB/sec)
Downloading: http://dev.davidsoergel.com/nexus/content/groups/public/org/apache/maven/maven-plugin-parameter-documenter/2.0.6/maven-plugin-parameter-documenter-2.0.6.pom
Downloaded: http://dev.davidsoergel.com/nexus/content/groups/public/org/apache/maven/maven-plugin-parameter-documenter/2.0.6/maven-plugin-parameter-documenter-2.0.6.pom (2 KB at 13.5 KB/sec)
Downloading: http://dev.davidsoergel.com/nexus/content/groups/public/org/apache/maven/reporting/maven-reporting-api/2.0.6/maven-reporting-api-2.0.6.pom
Downloaded: http://dev.davidsoergel.com/nexus/content/groups/public/org/apache/maven/reporting/maven-reporting-api/2.0.6/maven-reporting-api-2.0.6.pom (2 KB at 40.7 KB/sec)
Downloading: http://dev.davidsoergel.com/nexus/content/groups/public/org/apache/maven/reporting/maven-reporting/2.0.6/maven-reporting-2.0.6.pom
Downloaded: http://dev.davidsoergel.com/nexus/content/groups/public/org/apache/maven/reporting/maven-reporting/2.0.6/maven-reporting-2.0.6.pom (2 KB at 52.0 KB/sec)
Downloading: http://dev.davidsoergel.com/nexus/content/groups/public/org/apache/maven/maven-profile/2.0.6/maven-profile-2.0.6.pom
Downloaded: http://dev.davidsoergel.com/nexus/content/groups/public/org/apache/maven/maven-profile/2.0.6/maven-profile-2.0.6.pom (2 KB at 15.5 KB/sec)
Downloading: http://dev.davidsoergel.com/nexus/content/groups/public/org/apache/maven/maven-repository-metadata/2.0.6/maven-repository-metadata-2.0.6.pom
Downloaded: http://dev.davidsoergel.com/nexus/content/groups/public/org/apache/maven/maven-repository-metadata/2.0.6/maven-repository-metadata-2.0.6.pom (2 KB at 16.0 KB/sec)
Downloading: http://dev.davidsoergel.com/nexus/content/groups/public/org/apache/maven/maven-error-diagnostics/2.0.6/maven-error-diagnostics-2.0.6.pom
Downloaded: http://dev.davidsoergel.com/nexus/content/groups/public/org/apache/maven/maven-error-diagnostics/2.0.6/maven-error-diagnostics-2.0.6.pom (2 KB at 15.7 KB/sec)
Downloading: http://dev.davidsoergel.com/nexus/content/groups/public/org/apache/maven/maven-project/2.0.6/maven-project-2.0.6.pom
Downloaded: http://dev.davidsoergel.com/nexus/content/groups/public/org/apache/maven/maven-project/2.0.6/maven-project-2.0.6.pom (3 KB at 19.5 KB/sec)
Downloading: http://dev.davidsoergel.com/nexus/content/groups/public/org/apache/maven/maven-artifact-manager/2.0.6/maven-artifact-manager-2.0.6.pom
Downloaded: http://dev.davidsoergel.com/nexus/content/groups/public/org/apache/maven/maven-artifact-manager/2.0.6/maven-artifact-manager-2.0.6.pom (3 KB at 32.8 KB/sec)
Downloading: http://dev.davidsoergel.com/nexus/content/groups/public/org/apache/maven/maven-plugin-registry/2.0.6/maven-plugin-registry-2.0.6.pom
Downloaded: http://dev.davidsoergel.com/nexus/content/groups/public/org/apache/maven/maven-plugin-registry/2.0.6/maven-plugin-registry-2.0.6.pom (2 KB at 7.8 KB/sec)
Downloading: http://dev.davidsoergel.com/nexus/content/groups/public/org/apache/maven/maven-plugin-descriptor/2.0.6/maven-plugin-descriptor-2.0.6.pom
Downloaded: http://dev.davidsoergel.com/nexus/content/groups/public/org/apache/maven/maven-plugin-descriptor/2.0.6/maven-plugin-descriptor-2.0.6.pom (2 KB at 21.7 KB/sec)
Downloading: http://dev.davidsoergel.com/nexus/content/groups/public/org/apache/maven/maven-monitor/2.0.6/maven-monitor-2.0.6.pom
Downloaded: http://dev.davidsoergel.com/nexus/content/groups/public/org/apache/maven/maven-monitor/2.0.6/maven-monitor-2.0.6.pom (2 KB at 2.5 KB/sec)
Downloading: http://dev.davidsoergel.com/nexus/content/groups/public/org/codehaus/plexus/plexus-archiver/2.1/plexus-archiver-2.1.pom
Downloaded: http://dev.davidsoergel.com/nexus/content/groups/public/org/codehaus/plexus/plexus-archiver/2.1/plexus-archiver-2.1.pom (3 KB at 57.1 KB/sec)
Downloading: http://dev.davidsoergel.com/nexus/content/groups/public/org/sonatype/spice/spice-parent/17/spice-parent-17.pom
Downloaded: http://dev.davidsoergel.com/nexus/content/groups/public/org/sonatype/spice/spice-parent/17/spice-parent-17.pom (7 KB at 34.9 KB/sec)
Downloading: http://dev.davidsoergel.com/nexus/content/groups/public/org/sonatype/forge/forge-parent/10/forge-parent-10.pom
Downloaded: http://dev.davidsoergel.com/nexus/content/groups/public/org/sonatype/forge/forge-parent/10/forge-parent-10.pom (14 KB at 41.3 KB/sec)
Downloading: http://dev.davidsoergel.com/nexus/content/groups/public/org/codehaus/plexus/plexus-utils/3.0/plexus-utils-3.0.pom
Downloaded: http://dev.davidsoergel.com/nexus/content/groups/public/org/codehaus/plexus/plexus-utils/3.0/plexus-utils-3.0.pom (4 KB at 27.8 KB/sec)
Downloading: http://dev.davidsoergel.com/nexus/content/groups/public/org/sonatype/spice/spice-parent/16/spice-parent-16.pom
Downloaded: http://dev.davidsoergel.com/nexus/content/groups/public/org/sonatype/spice/spice-parent/16/spice-parent-16.pom (9 KB at 247.3 KB/sec)
Downloading: http://dev.davidsoergel.com/nexus/content/groups/public/org/sonatype/forge/forge-parent/5/forge-parent-5.pom
Downloaded: http://dev.davidsoergel.com/nexus/content/groups/public/org/sonatype/forge/forge-parent/5/forge-parent-5.pom (9 KB at 20.2 KB/sec)
Downloading: http://dev.davidsoergel.com/nexus/content/groups/public/org/codehaus/plexus/plexus-io/2.0.2/plexus-io-2.0.2.pom
Downloaded: http://dev.davidsoergel.com/nexus/content/groups/public/org/codehaus/plexus/plexus-io/2.0.2/plexus-io-2.0.2.pom (2 KB at 17.3 KB/sec)
Downloading: http://dev.davidsoergel.com/nexus/content/groups/public/org/codehaus/plexus/plexus-components/1.1.19/plexus-components-1.1.19.pom
Downloaded: http://dev.davidsoergel.com/nexus/content/groups/public/org/codehaus/plexus/plexus-components/1.1.19/plexus-components-1.1.19.pom (3 KB at 18.2 KB/sec)
Downloading: http://dev.davidsoergel.com/nexus/content/groups/public/org/codehaus/plexus/plexus/3.0.1/plexus-3.0.1.pom
Downloaded: http://dev.davidsoergel.com/nexus/content/groups/public/org/codehaus/plexus/plexus/3.0.1/plexus-3.0.1.pom (19 KB at 140.9 KB/sec)
Downloading: http://dev.davidsoergel.com/nexus/content/groups/public/org/codehaus/plexus/plexus-interpolation/1.15/plexus-interpolation-1.15.pom
Downloaded: http://dev.davidsoergel.com/nexus/content/groups/public/org/codehaus/plexus/plexus-interpolation/1.15/plexus-interpolation-1.15.pom (1018 B at 24.2 KB/sec)
Downloading: http://dev.davidsoergel.com/nexus/content/groups/public/org/codehaus/plexus/plexus-archiver/2.2/plexus-archiver-2.2.pom
Downloaded: http://dev.davidsoergel.com/nexus/content/groups/public/org/codehaus/plexus/plexus-archiver/2.2/plexus-archiver-2.2.pom (4 KB at 10.1 KB/sec)
Downloading: http://dev.davidsoergel.com/nexus/content/groups/public/org/codehaus/plexus/plexus-components/1.1.20/plexus-components-1.1.20.pom
Downloaded: http://dev.davidsoergel.com/nexus/content/groups/public/org/codehaus/plexus/plexus-components/1.1.20/plexus-components-1.1.20.pom (3 KB at 19.0 KB/sec)
Downloading: http://dev.davidsoergel.com/nexus/content/groups/public/org/codehaus/plexus/plexus/3.1/plexus-3.1.pom
Downloaded: http://dev.davidsoergel.com/nexus/content/groups/public/org/codehaus/plexus/plexus/3.1/plexus-3.1.pom (19 KB at 113.6 KB/sec)
Downloading: http://dev.davidsoergel.com/nexus/content/groups/public/org/codehaus/plexus/plexus-utils/3.0.7/plexus-utils-3.0.7.pom
Downloaded: http://dev.davidsoergel.com/nexus/content/groups/public/org/codehaus/plexus/plexus-utils/3.0.7/plexus-utils-3.0.7.pom (3 KB at 20.4 KB/sec)
Downloading: http://dev.davidsoergel.com/nexus/content/groups/public/org/codehaus/plexus/plexus-io/2.0.4/plexus-io-2.0.4.pom
Downloaded: http://dev.davidsoergel.com/nexus/content/groups/public/org/codehaus/plexus/plexus-io/2.0.4/plexus-io-2.0.4.pom (2 KB at 12.9 KB/sec)
Downloading: http://dev.davidsoergel.com/nexus/content/groups/public/org/codehaus/plexus/plexus-utils/3.0.8/plexus-utils-3.0.8.pom
Downloaded: http://dev.davidsoergel.com/nexus/content/groups/public/org/codehaus/plexus/plexus-utils/3.0.8/plexus-utils-3.0.8.pom (4 KB at 19.3 KB/sec)
Downloading: http://dev.davidsoergel.com/nexus/content/groups/public/org/codehaus/plexus/plexus/3.2/plexus-3.2.pom
Downloaded: http://dev.davidsoergel.com/nexus/content/groups/public/org/codehaus/plexus/plexus/3.2/plexus-3.2.pom (19 KB at 147.6 KB/sec)
Downloading: http://dev.davidsoergel.com/nexus/content/groups/public/org/apache/maven/maven-archiver/2.5/maven-archiver-2.5.jar
Downloading: http://dev.davidsoergel.com/nexus/content/groups/public/org/apache/maven/reporting/maven-reporting-api/2.0.6/maven-reporting-api-2.0.6.jar
Downloading: http://dev.davidsoergel.com/nexus/content/groups/public/org/apache/maven/doxia/doxia-sink-api/1.0-alpha-7/doxia-sink-api-1.0-alpha-7.jar
Downloading: http://dev.davidsoergel.com/nexus/content/groups/public/org/codehaus/plexus/plexus-interpolation/1.15/plexus-interpolation-1.15.jar
Downloading: http://dev.davidsoergel.com/nexus/content/groups/public/org/codehaus/plexus/plexus-archiver/2.2/plexus-archiver-2.2.jar
Downloaded: http://dev.davidsoergel.com/nexus/content/groups/public/org/apache/maven/maven-archiver/2.5/maven-archiver-2.5.jar (22 KB at 132.3 KB/sec)
Downloading: http://dev.davidsoergel.com/nexus/content/groups/public/org/codehaus/plexus/plexus-io/2.0.4/plexus-io-2.0.4.jar
Downloaded: http://dev.davidsoergel.com/nexus/content/groups/public/org/apache/maven/reporting/maven-reporting-api/2.0.6/maven-reporting-api-2.0.6.jar (10 KB at 48.1 KB/sec)
Downloading: http://dev.davidsoergel.com/nexus/content/groups/public/org/codehaus/plexus/plexus-utils/3.0.8/plexus-utils-3.0.8.jar
Downloaded: http://dev.davidsoergel.com/nexus/content/groups/public/org/apache/maven/doxia/doxia-sink-api/1.0-alpha-7/doxia-sink-api-1.0-alpha-7.jar (6 KB at 20.1 KB/sec)
Downloaded: http://dev.davidsoergel.com/nexus/content/groups/public/org/codehaus/plexus/plexus-interpolation/1.15/plexus-interpolation-1.15.jar (60 KB at 210.2 KB/sec)
Downloaded: http://dev.davidsoergel.com/nexus/content/groups/public/org/codehaus/plexus/plexus-io/2.0.4/plexus-io-2.0.4.jar (57 KB at 193.6 KB/sec)
Downloaded: http://dev.davidsoergel.com/nexus/content/groups/public/org/codehaus/plexus/plexus-archiver/2.2/plexus-archiver-2.2.jar (181 KB at 420.1 KB/sec)
Downloaded: http://dev.davidsoergel.com/nexus/content/groups/public/org/codehaus/plexus/plexus-utils/3.0.8/plexus-utils-3.0.8.jar (227 KB at 637.7 KB/sec)
[INFO] Building jar: /media/ephemeral0/workspace/sequtils/target/sequtils-0.92-SNAPSHOT-sources.jar
[INFO] Downloading: http://dev.davidsoergel.com/nexus/content/groups/public/org/apache/maven/shared/maven-filtering/1.0/maven-filtering-1.0.pom

[INFO] --- maven-resources-plugin:2.5:resources (default-resources) @ sequtils ---
Downloaded: http://dev.davidsoergel.com/nexus/content/groups/public/org/apache/maven/shared/maven-filtering/1.0/maven-filtering-1.0.pom (6 KB at 39.7 KB/sec)
Downloading: http://dev.davidsoergel.com/nexus/content/groups/public/org/apache/maven/shared/maven-shared-components/16/maven-shared-components-16.pom
Downloaded: http://dev.davidsoergel.com/nexus/content/groups/public/org/apache/maven/shared/maven-shared-components/16/maven-shared-components-16.pom (9 KB at 171.9 KB/sec)
Downloading: http://dev.davidsoergel.com/nexus/content/groups/public/org/codehaus/plexus/plexus-utils/1.5.15/plexus-utils-1.5.15.pom
Downloaded: http://dev.davidsoergel.com/nexus/content/groups/public/org/codehaus/plexus/plexus-utils/1.5.15/plexus-utils-1.5.15.pom (7 KB at 46.4 KB/sec)
Downloading: http://dev.davidsoergel.com/nexus/content/groups/public/org/codehaus/plexus/plexus-interpolation/1.12/plexus-interpolation-1.12.pom
Downloaded: http://dev.davidsoergel.com/nexus/content/groups/public/org/codehaus/plexus/plexus-interpolation/1.12/plexus-interpolation-1.12.pom (889 B at 6.3 KB/sec)
Downloading: http://dev.davidsoergel.com/nexus/content/groups/public/org/codehaus/plexus/plexus-components/1.1.14/plexus-components-1.1.14.pom
Downloaded: http://dev.davidsoergel.com/nexus/content/groups/public/org/codehaus/plexus/plexus-components/1.1.14/plexus-components-1.1.14.pom (6 KB at 158.5 KB/sec)
Downloading: http://dev.davidsoergel.com/nexus/content/groups/public/org/sonatype/plexus/plexus-build-api/0.0.4/plexus-build-api-0.0.4.pom
Downloaded: http://dev.davidsoergel.com/nexus/content/groups/public/org/sonatype/plexus/plexus-build-api/0.0.4/plexus-build-api-0.0.4.pom (3 KB at 23.5 KB/sec)
Downloading: http://dev.davidsoergel.com/nexus/content/groups/public/org/sonatype/spice/spice-parent/10/spice-parent-10.pom
Downloaded: http://dev.davidsoergel.com/nexus/content/groups/public/org/sonatype/spice/spice-parent/10/spice-parent-10.pom (3 KB at 22.0 KB/sec)
Downloading: http://dev.davidsoergel.com/nexus/content/groups/public/org/sonatype/forge/forge-parent/3/forge-parent-3.pom
Downloaded: http://dev.davidsoergel.com/nexus/content/groups/public/org/sonatype/forge/forge-parent/3/forge-parent-3.pom (5 KB at 65.5 KB/sec)
Downloading: http://dev.davidsoergel.com/nexus/content/groups/public/org/codehaus/plexus/plexus-utils/1.5.8/plexus-utils-1.5.8.pom
Downloaded: http://dev.davidsoergel.com/nexus/content/groups/public/org/codehaus/plexus/plexus-utils/1.5.8/plexus-utils-1.5.8.pom (8 KB at 129.1 KB/sec)
Downloading: http://dev.davidsoergel.com/nexus/content/groups/public/org/codehaus/plexus/plexus-interpolation/1.13/plexus-interpolation-1.13.pom
Downloaded: http://dev.davidsoergel.com/nexus/content/groups/public/org/codehaus/plexus/plexus-interpolation/1.13/plexus-interpolation-1.13.pom (890 B at 7.4 KB/sec)
Downloading: http://dev.davidsoergel.com/nexus/content/groups/public/org/codehaus/plexus/plexus-components/1.1.15/plexus-components-1.1.15.pom
Downloaded: http://dev.davidsoergel.com/nexus/content/groups/public/org/codehaus/plexus/plexus-components/1.1.15/plexus-components-1.1.15.pom (3 KB at 38.6 KB/sec)
Downloading: http://dev.davidsoergel.com/nexus/content/groups/public/org/codehaus/plexus/plexus/2.0.3/plexus-2.0.3.pom
Downloaded: http://dev.davidsoergel.com/nexus/content/groups/public/org/codehaus/plexus/plexus/2.0.3/plexus-2.0.3.pom (16 KB at 351.1 KB/sec)
Downloading: http://dev.davidsoergel.com/nexus/content/groups/public/org/apache/maven/shared/maven-filtering/1.0/maven-filtering-1.0.jar
Downloading: http://dev.davidsoergel.com/nexus/content/groups/public/org/sonatype/plexus/plexus-build-api/0.0.4/plexus-build-api-0.0.4.jar
Downloading: http://dev.davidsoergel.com/nexus/content/groups/public/org/codehaus/plexus/plexus-interpolation/1.13/plexus-interpolation-1.13.jar
Downloaded: http://dev.davidsoergel.com/nexus/content/groups/public/org/apache/maven/shared/maven-filtering/1.0/maven-filtering-1.0.jar (42 KB at 291.2 KB/sec)
Downloaded: http://dev.davidsoergel.com/nexus/content/groups/public/org/sonatype/plexus/plexus-build-api/0.0.4/plexus-build-api-0.0.4.jar (7 KB at 46.5 KB/sec)
Downloaded: http://dev.davidsoergel.com/nexus/content/groups/public/org/codehaus/plexus/plexus-interpolation/1.13/plexus-interpolation-1.13.jar (60 KB at 417.0 KB/sec)
[debug] execute contextualize
[INFO] Using 'UTF-8' encoding to copy filtered resources.
[INFO] skip non existing resourceDirectory /media/ephemeral0/workspace/sequtils/src/main/resources
Downloading: http://dev.davidsoergel.com/nexus/content/groups/public/org/apache/maven/maven-core/2.0.9/maven-core-2.0.9.pom
[INFO] 
[INFO] --- maven-compiler-plugin:2.4:compile (default-compile) @ sequtils ---
Downloaded: http://dev.davidsoergel.com/nexus/content/groups/public/org/apache/maven/maven-core/2.0.9/maven-core-2.0.9.pom (8 KB at 56.3 KB/sec)
Downloading: http://dev.davidsoergel.com/nexus/content/groups/public/org/apache/maven/maven-plugin-parameter-documenter/2.0.9/maven-plugin-parameter-documenter-2.0.9.pom
Downloaded: http://dev.davidsoergel.com/nexus/content/groups/public/org/apache/maven/maven-plugin-parameter-documenter/2.0.9/maven-plugin-parameter-documenter-2.0.9.pom (2 KB at 19.8 KB/sec)
Downloading: http://dev.davidsoergel.com/nexus/content/groups/public/org/apache/maven/maven-error-diagnostics/2.0.9/maven-error-diagnostics-2.0.9.pom
Downloaded: http://dev.davidsoergel.com/nexus/content/groups/public/org/apache/maven/maven-error-diagnostics/2.0.9/maven-error-diagnostics-2.0.9.pom (2 KB at 14.2 KB/sec)
Downloading: http://dev.davidsoergel.com/nexus/content/groups/public/org/apache/maven/maven-plugin-descriptor/2.0.9/maven-plugin-descriptor-2.0.9.pom
Downloaded: http://dev.davidsoergel.com/nexus/content/groups/public/org/apache/maven/maven-plugin-descriptor/2.0.9/maven-plugin-descriptor-2.0.9.pom (3 KB at 14.8 KB/sec)
Downloading: http://dev.davidsoergel.com/nexus/content/groups/public/org/apache/maven/maven-monitor/2.0.9/maven-monitor-2.0.9.pom
Downloaded: http://dev.davidsoergel.com/nexus/content/groups/public/org/apache/maven/maven-monitor/2.0.9/maven-monitor-2.0.9.pom (2 KB at 15.7 KB/sec)
Downloading: http://dev.davidsoergel.com/nexus/content/groups/public/org/apache/maven/maven-toolchain/1.0/maven-toolchain-1.0.pom
Downloaded: http://dev.davidsoergel.com/nexus/content/groups/public/org/apache/maven/maven-toolchain/1.0/maven-toolchain-1.0.pom (4 KB at 61.7 KB/sec)
Downloading: http://dev.davidsoergel.com/nexus/content/groups/public/org/codehaus/plexus/plexus-compiler-api/1.8.6/plexus-compiler-api-1.8.6.pom
Downloaded: http://dev.davidsoergel.com/nexus/content/groups/public/org/codehaus/plexus/plexus-compiler-api/1.8.6/plexus-compiler-api-1.8.6.pom (780 B at 8.4 KB/sec)
Downloading: http://dev.davidsoergel.com/nexus/content/groups/public/org/codehaus/plexus/plexus-compiler/1.8.6/plexus-compiler-1.8.6.pom
Downloaded: http://dev.davidsoergel.com/nexus/content/groups/public/org/codehaus/plexus/plexus-compiler/1.8.6/plexus-compiler-1.8.6.pom (4 KB at 83.0 KB/sec)
Downloading: http://dev.davidsoergel.com/nexus/content/groups/public/org/codehaus/plexus/plexus-compiler-manager/1.8.6/plexus-compiler-manager-1.8.6.pom
Downloaded: http://dev.davidsoergel.com/nexus/content/groups/public/org/codehaus/plexus/plexus-compiler-manager/1.8.6/plexus-compiler-manager-1.8.6.pom (692 B at 5.6 KB/sec)
Downloading: http://dev.davidsoergel.com/nexus/content/groups/public/org/codehaus/plexus/plexus-compiler-javac/1.8.6/plexus-compiler-javac-1.8.6.pom
Downloaded: http://dev.davidsoergel.com/nexus/content/groups/public/org/codehaus/plexus/plexus-compiler-javac/1.8.6/plexus-compiler-javac-1.8.6.pom (688 B at 10.2 KB/sec)
Downloading: http://dev.davidsoergel.com/nexus/content/groups/public/org/codehaus/plexus/plexus-compilers/1.8.6/plexus-compilers-1.8.6.pom
Downloaded: http://dev.davidsoergel.com/nexus/content/groups/public/org/codehaus/plexus/plexus-compilers/1.8.6/plexus-compilers-1.8.6.pom (2 KB at 13.3 KB/sec)
Downloading: http://dev.davidsoergel.com/nexus/content/groups/public/org/codehaus/plexus/plexus-utils/3.0/plexus-utils-3.0.jar
Downloading: http://dev.davidsoergel.com/nexus/content/groups/public/org/codehaus/plexus/plexus-compiler-api/1.8.6/plexus-compiler-api-1.8.6.jar
Downloading: http://dev.davidsoergel.com/nexus/content/groups/public/org/codehaus/plexus/plexus-compiler-manager/1.8.6/plexus-compiler-manager-1.8.6.jar
Downloading: http://dev.davidsoergel.com/nexus/content/groups/public/org/codehaus/plexus/plexus-compiler-javac/1.8.6/plexus-compiler-javac-1.8.6.jar
Downloaded: http://dev.davidsoergel.com/nexus/content/groups/public/org/codehaus/plexus/plexus-compiler-api/1.8.6/plexus-compiler-api-1.8.6.jar (19 KB at 117.7 KB/sec)
Downloaded: http://dev.davidsoergel.com/nexus/content/groups/public/org/codehaus/plexus/plexus-utils/3.0/plexus-utils-3.0.jar (221 KB at 1254.4 KB/sec)
Downloaded: http://dev.davidsoergel.com/nexus/content/groups/public/org/codehaus/plexus/plexus-compiler-manager/1.8.6/plexus-compiler-manager-1.8.6.jar (5 KB at 20.3 KB/sec)
Downloaded: http://dev.davidsoergel.com/nexus/content/groups/public/org/codehaus/plexus/plexus-compiler-javac/1.8.6/plexus-compiler-javac-1.8.6.jar (13 KB at 56.8 KB/sec)
[INFO] Compiling 66 source files to /media/ephemeral0/workspace/sequtils/target/classes
[INFO] 
[INFO] --- maven-resources-plugin:2.5:testResources (default-testResources) @ sequtils ---
[debug] execute contextualize
[INFO] Using 'UTF-8' encoding to copy filtered resources.
[INFO] Copying 3 resources
[INFO] 
[INFO] --- maven-compiler-plugin:2.4:testCompile (default-testCompile) @ sequtils ---
[INFO] Compiling 11 source files to /media/ephemeral0/workspace/sequtils/target/test-classes
[INFO] 
[INFO] --- maven-surefire-plugin:2.12:test (default-test) @ sequtils ---
Downloading: http://dev.davidsoergel.com/nexus/content/groups/public/org/apache/maven/surefire/surefire-booter/2.12/surefire-booter-2.12.pom
Downloaded: http://dev.davidsoergel.com/nexus/content/groups/public/org/apache/maven/surefire/surefire-booter/2.12/surefire-booter-2.12.pom (3 KB at 11.3 KB/sec)
Downloading: http://dev.davidsoergel.com/nexus/content/groups/public/org/apache/maven/surefire/surefire-api/2.12/surefire-api-2.12.pom
Downloaded: http://dev.davidsoergel.com/nexus/content/groups/public/org/apache/maven/surefire/surefire-api/2.12/surefire-api-2.12.pom (3 KB at 45.9 KB/sec)
Downloading: http://dev.davidsoergel.com/nexus/content/groups/public/org/apache/maven/surefire/maven-surefire-common/2.12/maven-surefire-common-2.12.pom
Downloaded: http://dev.davidsoergel.com/nexus/content/groups/public/org/apache/maven/surefire/maven-surefire-common/2.12/maven-surefire-common-2.12.pom (6 KB at 35.8 KB/sec)
Downloading: http://dev.davidsoergel.com/nexus/content/groups/public/org/apache/maven/reporting/maven-reporting-api/2.0.9/maven-reporting-api-2.0.9.pom
Downloaded: http://dev.davidsoergel.com/nexus/content/groups/public/org/apache/maven/reporting/maven-reporting-api/2.0.9/maven-reporting-api-2.0.9.pom (2 KB at 47.6 KB/sec)
Downloading: http://dev.davidsoergel.com/nexus/content/groups/public/org/apache/maven/reporting/maven-reporting/2.0.9/maven-reporting-2.0.9.pom
Downloaded: http://dev.davidsoergel.com/nexus/content/groups/public/org/apache/maven/reporting/maven-reporting/2.0.9/maven-reporting-2.0.9.pom (2 KB at 5.9 KB/sec)
Downloading: http://dev.davidsoergel.com/nexus/content/groups/public/org/apache/maven/maven-toolchain/2.0.9/maven-toolchain-2.0.9.pom
Downloaded: http://dev.davidsoergel.com/nexus/content/groups/public/org/apache/maven/maven-toolchain/2.0.9/maven-toolchain-2.0.9.pom (4 KB at 21.3 KB/sec)
Downloading: http://dev.davidsoergel.com/nexus/content/groups/public/org/apache/maven/shared/maven-common-artifact-filters/1.3/maven-common-artifact-filters-1.3.pom
Downloaded: http://dev.davidsoergel.com/nexus/content/groups/public/org/apache/maven/shared/maven-common-artifact-filters/1.3/maven-common-artifact-filters-1.3.pom (4 KB at 30.4 KB/sec)
Downloading: http://dev.davidsoergel.com/nexus/content/groups/public/org/apache/maven/surefire/surefire-booter/2.12/surefire-booter-2.12.jar
Downloading: http://dev.davidsoergel.com/nexus/content/groups/public/org/apache/maven/surefire/surefire-api/2.12/surefire-api-2.12.jar
Downloading: http://dev.davidsoergel.com/nexus/content/groups/public/org/apache/maven/surefire/maven-surefire-common/2.12/maven-surefire-common-2.12.jar
Downloading: http://dev.davidsoergel.com/nexus/content/groups/public/org/apache/maven/shared/maven-common-artifact-filters/1.3/maven-common-artifact-filters-1.3.jar
Downloading: http://dev.davidsoergel.com/nexus/content/groups/public/org/apache/maven/reporting/maven-reporting-api/2.0.9/maven-reporting-api-2.0.9.jar
Downloaded: http://dev.davidsoergel.com/nexus/content/groups/public/org/apache/maven/surefire/surefire-booter/2.12/surefire-booter-2.12.jar (33 KB at 151.4 KB/sec)
Downloaded: http://dev.davidsoergel.com/nexus/content/groups/public/org/apache/maven/surefire/surefire-api/2.12/surefire-api-2.12.jar (122 KB at 347.7 KB/sec)
Downloaded: http://dev.davidsoergel.com/nexus/content/groups/public/org/apache/maven/surefire/maven-surefire-common/2.12/maven-surefire-common-2.12.jar (219 KB at 633.2 KB/sec)
Downloaded: http://dev.davidsoergel.com/nexus/content/groups/public/org/apache/maven/shared/maven-common-artifact-filters/1.3/maven-common-artifact-filters-1.3.jar (31 KB at 60.8 KB/sec)
Downloaded: http://dev.davidsoergel.com/nexus/content/groups/public/org/apache/maven/reporting/maven-reporting-api/2.0.9/maven-reporting-api-2.0.9.jar (10 KB at 24.9 KB/sec)
[INFO] Surefire report directory: /media/ephemeral0/workspace/sequtils/target/surefire-reports
Downloading: http://dev.davidsoergel.com/nexus/content/groups/public/org/apache/maven/surefire/surefire-testng/2.12/surefire-testng-2.12.pom
Downloaded: http://dev.davidsoergel.com/nexus/content/groups/public/org/apache/maven/surefire/surefire-testng/2.12/surefire-testng-2.12.pom (4 KB at 29.2 KB/sec)
Downloading: http://dev.davidsoergel.com/nexus/content/groups/public/org/apache/maven/surefire/surefire-providers/2.12/surefire-providers-2.12.pom
Downloaded: http://dev.davidsoergel.com/nexus/content/groups/public/org/apache/maven/surefire/surefire-providers/2.12/surefire-providers-2.12.pom (3 KB at 57.3 KB/sec)
Downloading: http://dev.davidsoergel.com/nexus/content/groups/public/org/apache/maven/maven-artifact/2.0/maven-artifact-2.0.pom
Downloaded: http://dev.davidsoergel.com/nexus/content/groups/public/org/apache/maven/maven-artifact/2.0/maven-artifact-2.0.pom (723 B at 2.5 KB/sec)
Downloading: http://dev.davidsoergel.com/nexus/content/groups/public/org/apache/maven/surefire/surefire-testng-utils/2.12/surefire-testng-utils-2.12.pom
Downloaded: http://dev.davidsoergel.com/nexus/content/groups/public/org/apache/maven/surefire/surefire-testng-utils/2.12/surefire-testng-utils-2.12.pom (3 KB at 5.9 KB/sec)
Downloading: http://dev.davidsoergel.com/nexus/content/groups/public/org/apache/maven/surefire/surefire-grouper/2.12/surefire-grouper-2.12.pom
Downloaded: http://dev.davidsoergel.com/nexus/content/groups/public/org/apache/maven/surefire/surefire-grouper/2.12/surefire-grouper-2.12.pom (3 KB at 57.3 KB/sec)
Downloading: http://dev.davidsoergel.com/nexus/content/groups/public/org/testng/testng/5.7/testng-5.7.pom
Downloaded: http://dev.davidsoergel.com/nexus/content/groups/public/org/testng/testng/5.7/testng-5.7.pom (12 KB at 72.3 KB/sec)
Downloading: http://dev.davidsoergel.com/nexus/content/groups/public/org/codehaus/plexus/plexus-utils/1.4.9/plexus-utils-1.4.9.pom
Downloaded: http://dev.davidsoergel.com/nexus/content/groups/public/org/codehaus/plexus/plexus-utils/1.4.9/plexus-utils-1.4.9.pom (3 KB at 43.1 KB/sec)
Downloading: http://dev.davidsoergel.com/nexus/content/groups/public/org/apache/maven/surefire/surefire-grouper/2.12/surefire-grouper-2.12.jar
Downloading: http://dev.davidsoergel.com/nexus/content/groups/public/org/apache/maven/maven-artifact/2.0/maven-artifact-2.0.jar
Downloading: http://dev.davidsoergel.com/nexus/content/groups/public/org/apache/maven/surefire/surefire-testng/2.12/surefire-testng-2.12.jar
Downloading: http://dev.davidsoergel.com/nexus/content/groups/public/org/apache/maven/surefire/surefire-testng-utils/2.12/surefire-testng-utils-2.12.jar
Downloading: http://dev.davidsoergel.com/nexus/content/groups/public/org/apache/maven/maven-plugin-api/2.0.9/maven-plugin-api-2.0.9.jar
Downloaded: http://dev.davidsoergel.com/nexus/content/groups/public/org/apache/maven/surefire/surefire-testng-utils/2.12/surefire-testng-utils-2.12.jar (21 KB at 82.1 KB/sec)
Downloaded: http://dev.davidsoergel.com/nexus/content/groups/public/org/apache/maven/maven-artifact/2.0/maven-artifact-2.0.jar (77 KB at 298.1 KB/sec)
Downloaded: http://dev.davidsoergel.com/nexus/content/groups/public/org/apache/maven/surefire/surefire-grouper/2.12/surefire-grouper-2.12.jar (37 KB at 142.4 KB/sec)
Downloaded: http://dev.davidsoergel.com/nexus/content/groups/public/org/apache/maven/maven-plugin-api/2.0.9/maven-plugin-api-2.0.9.jar (13 KB at 50.2 KB/sec)
Downloaded: http://dev.davidsoergel.com/nexus/content/groups/public/org/apache/maven/surefire/surefire-testng/2.12/surefire-testng-2.12.jar (32 KB at 125.9 KB/sec)
Downloading: http://dev.davidsoergel.com/nexus/content/groups/public/org/apache/maven/maven-project/2.0.9/maven-project-2.0.9.jar
Downloading: http://dev.davidsoergel.com/nexus/content/groups/public/org/apache/maven/maven-model/2.0.9/maven-model-2.0.9.jar
Downloading: http://dev.davidsoergel.com/nexus/content/groups/public/org/apache/maven/maven-settings/2.0.9/maven-settings-2.0.9.jar
Downloading: http://dev.davidsoergel.com/nexus/content/groups/public/classworlds/classworlds/1.1/classworlds-1.1.jar
Downloading: http://dev.davidsoergel.com/nexus/content/groups/public/org/codehaus/plexus/plexus-container-default/1.0-alpha-9-stable-1/plexus-container-default-1.0-alpha-9-stable-1.jar
Downloaded: http://dev.davidsoergel.com/nexus/content/groups/public/org/apache/maven/maven-settings/2.0.9/maven-settings-2.0.9.jar (48 KB at 203.2 KB/sec)
Downloaded: http://dev.davidsoergel.com/nexus/content/groups/public/classworlds/classworlds/1.1/classworlds-1.1.jar (37 KB at 155.3 KB/sec)
Downloaded: http://dev.davidsoergel.com/nexus/content/groups/public/org/apache/maven/maven-model/2.0.9/maven-model-2.0.9.jar (86 KB at 353.8 KB/sec)
Downloaded: http://dev.davidsoergel.com/nexus/content/groups/public/org/apache/maven/maven-project/2.0.9/maven-project-2.0.9.jar (119 KB at 487.4 KB/sec)
Downloading: http://dev.davidsoergel.com/nexus/content/groups/public/org/apache/maven/wagon/wagon-provider-api/1.0-beta-2/wagon-provider-api-1.0-beta-2.jar
Downloading: http://dev.davidsoergel.com/nexus/content/groups/public/org/apache/maven/maven-artifact-manager/2.0.9/maven-artifact-manager-2.0.9.jar
Downloading: http://dev.davidsoergel.com/nexus/content/groups/public/org/apache/maven/maven-profile/2.0.9/maven-profile-2.0.9.jar
Downloading: http://dev.davidsoergel.com/nexus/content/groups/public/org/apache/maven/maven-repository-metadata/2.0.9/maven-repository-metadata-2.0.9.jar
Downloaded: http://dev.davidsoergel.com/nexus/content/groups/public/org/codehaus/plexus/plexus-container-default/1.0-alpha-9-stable-1/plexus-container-default-1.0-alpha-9-stable-1.jar (190 KB at 499.0 KB/sec)
Downloading: http://dev.davidsoergel.com/nexus/content/groups/public/org/apache/maven/maven-plugin-registry/2.0.9/maven-plugin-registry-2.0.9.jar
Downloaded: http://dev.davidsoergel.com/nexus/content/groups/public/org/apache/maven/maven-artifact-manager/2.0.9/maven-artifact-manager-2.0.9.jar (57 KB at 234.4 KB/sec)
Downloaded: http://dev.davidsoergel.com/nexus/content/groups/public/org/apache/maven/wagon/wagon-provider-api/1.0-beta-2/wagon-provider-api-1.0-beta-2.jar (46 KB at 181.7 KB/sec)
Downloaded: http://dev.davidsoergel.com/nexus/content/groups/public/org/apache/maven/maven-profile/2.0.9/maven-profile-2.0.9.jar (35 KB at 140.9 KB/sec)
Downloading: http://dev.davidsoergel.com/nexus/content/groups/public/org/apache/maven/maven-error-diagnostics/2.0.9/maven-error-diagnostics-2.0.9.jar
Downloading: http://dev.davidsoergel.com/nexus/content/groups/public/org/apache/maven/maven-core/2.0.9/maven-core-2.0.9.jar
Downloaded: http://dev.davidsoergel.com/nexus/content/groups/public/org/apache/maven/maven-plugin-registry/2.0.9/maven-plugin-registry-2.0.9.jar (29 KB at 122.9 KB/sec)
Downloaded: http://dev.davidsoergel.com/nexus/content/groups/public/org/apache/maven/maven-repository-metadata/2.0.9/maven-repository-metadata-2.0.9.jar (24 KB at 68.5 KB/sec)
Downloading: http://dev.davidsoergel.com/nexus/content/groups/public/org/apache/maven/maven-plugin-parameter-documenter/2.0.9/maven-plugin-parameter-documenter-2.0.9.jar
Downloading: http://dev.davidsoergel.com/nexus/content/groups/public/org/apache/maven/maven-monitor/2.0.9/maven-monitor-2.0.9.jar
Downloading: http://dev.davidsoergel.com/nexus/content/groups/public/org/apache/maven/maven-plugin-descriptor/2.0.9/maven-plugin-descriptor-2.0.9.jar
Downloaded: http://dev.davidsoergel.com/nexus/content/groups/public/org/apache/maven/maven-monitor/2.0.9/maven-monitor-2.0.9.jar (11 KB at 35.5 KB/sec)
Downloaded: http://dev.davidsoergel.com/nexus/content/groups/public/org/apache/maven/maven-core/2.0.9/maven-core-2.0.9.jar (156 KB at 517.9 KB/sec)
Downloaded: http://dev.davidsoergel.com/nexus/content/groups/public/org/apache/maven/maven-plugin-descriptor/2.0.9/maven-plugin-descriptor-2.0.9.jar (37 KB at 127.8 KB/sec)
Downloaded: http://dev.davidsoergel.com/nexus/content/groups/public/org/apache/maven/maven-error-diagnostics/2.0.9/maven-error-diagnostics-2.0.9.jar (14 KB at 34.1 KB/sec)
Downloaded: http://dev.davidsoergel.com/nexus/content/groups/public/org/apache/maven/maven-plugin-parameter-documenter/2.0.9/maven-plugin-parameter-documenter-2.0.9.jar (21 KB at 71.3 KB/sec)
Downloading: http://dev.davidsoergel.com/nexus/content/groups/public/org/apache/maven/maven-toolchain/2.0.9/maven-toolchain-2.0.9.jar
Downloaded: http://dev.davidsoergel.com/nexus/content/groups/public/org/apache/maven/maven-toolchain/2.0.9/maven-toolchain-2.0.9.jar (38 KB at 120.4 KB/sec)

-------------------------------------------------------
 T E S T S
-------------------------------------------------------
Running TestSuite
org.apache.maven.surefire.util.SurefireReflectionException: java.lang.reflect.InvocationTargetException; nested exception is java.lang.reflect.InvocationTargetException: null
java.lang.reflect.InvocationTargetException
	at sun.reflect.NativeMethodAccessorImpl.invoke0(Native Method)
	at sun.reflect.NativeMethodAccessorImpl.invoke(NativeMethodAccessorImpl.java:39)
	at sun.reflect.DelegatingMethodAccessorImpl.invoke(DelegatingMethodAccessorImpl.java:25)
	at java.lang.reflect.Method.invoke(Method.java:597)
	at org.apache.maven.surefire.util.ReflectionUtils.invokeMethodWithArray(ReflectionUtils.java:189)
	at org.apache.maven.surefire.booter.ProviderFactory$ProviderProxy.invoke(ProviderFactory.java:165)
	at org.apache.maven.surefire.booter.ProviderFactory.invokeProvider(ProviderFactory.java:85)
	at org.apache.maven.surefire.booter.ForkedBooter.runSuitesInProcess(ForkedBooter.java:103)
	at org.apache.maven.surefire.booter.ForkedBooter.main(ForkedBooter.java:74)
Caused by: java.lang.UnsupportedClassVersionError: com/davidsoergel/dsutils/TestInstanceFactory : Unsupported major.minor version 51.0
	at java.lang.ClassLoader.defineClass1(Native Method)
	at java.lang.ClassLoader.defineClassCond(ClassLoader.java:631)
	at java.lang.ClassLoader.defineClass(ClassLoader.java:615)
	at java.security.SecureClassLoader.defineClass(SecureClassLoader.java:141)
	at java.net.URLClassLoader.defineClass(URLClassLoader.java:283)
	at java.net.URLClassLoader.access$000(URLClassLoader.java:58)
	at java.net.URLClassLoader$1.run(URLClassLoader.java:197)
	at java.security.AccessController.doPrivileged(Native Method)
	at java.net.URLClassLoader.findClass(URLClassLoader.java:190)
	at java.lang.ClassLoader.loadClass(ClassLoader.java:306)
	at sun.misc.Launcher$AppClassLoader.loadClass(Launcher.java:301)
	at java.lang.ClassLoader.loadClass(ClassLoader.java:247)
	at java.lang.ClassLoader.defineClass1(Native Method)
	at java.lang.ClassLoader.defineClassCond(ClassLoader.java:631)
	at java.lang.ClassLoader.defineClass(ClassLoader.java:615)
	at java.security.SecureClassLoader.defineClass(SecureClassLoader.java:141)
	at java.net.URLClassLoader.defineClass(URLClassLoader.java:283)
	at java.net.URLClassLoader.access$000(URLClassLoader.java:58)
	at java.net.URLClassLoader$1.run(URLClassLoader.java:197)
	at java.security.AccessController.doPrivileged(Native Method)
	at java.net.URLClassLoader.findClass(URLClassLoader.java:190)
	at java.lang.ClassLoader.loadClass(ClassLoader.java:306)
	at sun.misc.Launcher$AppClassLoader.loadClass(Launcher.java:301)
	at java.lang.ClassLoader.loadClass(ClassLoader.java:247)
	at org.testng.internal.ClassHelper.forName(ClassHelper.java:95)
	at org.testng.xml.XmlClass.loadClass(XmlClass.java:73)
	at org.testng.xml.XmlClass.init(XmlClass.java:68)
	at org.testng.xml.XmlClass.<init>(XmlClass.java:54)
	at org.testng.xml.TestNGContentHandler.startElement(TestNGContentHandler.java:500)
	at com.sun.org.apache.xerces.internal.parsers.AbstractSAXParser.startElement(AbstractSAXParser.java:501)
	at com.sun.org.apache.xerces.internal.parsers.AbstractXMLDocumentParser.emptyElement(AbstractXMLDocumentParser.java:179)
	at com.sun.org.apache.xerces.internal.impl.dtd.XMLDTDValidator.emptyElement(XMLDTDValidator.java:788)
	at com.sun.org.apache.xerces.internal.impl.XMLDocumentFragmentScannerImpl.scanStartElement(XMLDocumentFragmentScannerImpl.java:1343)
	at com.sun.org.apache.xerces.internal.impl.XMLDocumentFragmentScannerImpl$FragmentContentDriver.next(XMLDocumentFragmentScannerImpl.java:2756)
	at com.sun.org.apache.xerces.internal.impl.XMLDocumentScannerImpl.next(XMLDocumentScannerImpl.java:647)
	at com.sun.org.apache.xerces.internal.impl.XMLDocumentFragmentScannerImpl.scanDocument(XMLDocumentFragmentScannerImpl.java:511)
	at com.sun.org.apache.xerces.internal.parsers.XML11Configuration.parse(XML11Configuration.java:808)
	at com.sun.org.apache.xerces.internal.parsers.XML11Configuration.parse(XML11Configuration.java:737)
	at com.sun.org.apache.xerces.internal.parsers.XMLParser.parse(XMLParser.java:119)
	at com.sun.org.apache.xerces.internal.parsers.AbstractSAXParser.parse(AbstractSAXParser.java:1205)
	at com.sun.org.apache.xerces.internal.jaxp.SAXParserImpl$JAXPSAXParser.parse(SAXParserImpl.java:522)
	at javax.xml.parsers.SAXParser.parse(SAXParser.java:395)
	at javax.xml.parsers.SAXParser.parse(SAXParser.java:198)
	at org.testng.xml.SuiteXmlParser.parse(SuiteXmlParser.java:17)
	at org.testng.xml.SuiteXmlParser.parse(SuiteXmlParser.java:10)
	at org.testng.xml.Parser.parse(Parser.java:170)
	at org.testng.TestNG.initializeSuitesAndJarFile(TestNG.java:283)
	at org.testng.TestNG.run(TestNG.java:879)
	at org.apache.maven.surefire.testng.TestNGExecutor.run(TestNGExecutor.java:177)
	at org.apache.maven.surefire.testng.TestNGXmlTestSuite.execute(TestNGXmlTestSuite.java:92)
	at org.apache.maven.surefire.testng.TestNGProvider.invoke(TestNGProvider.java:105)
	... 9 more

Results :

Tests run: 0, Failures: 0, Errors: 0, Skipped: 0

[JENKINS] Recording test results
[INFO] ------------------------------------------------------------------------
[INFO] BUILD FAILURE
[INFO] ------------------------------------------------------------------------
[INFO] Total time: 1:59.228s
[INFO] Finished at: Wed Mar 20 14:19:25 UTC 2013
[INFO] Final Memory: 15M/41M
[INFO] ------------------------------------------------------------------------
[JENKINS] Archiving /media/ephemeral0/workspace/sequtils/pom.xml to /usr/share/apache-tomcat-7.0.22/.jenkins/jobs/sequtils/modules/edu.berkeley.compbio$sequtils/builds/2013-03-20_10-17-15/archive/edu.berkeley.compbio/sequtils/0.92-SNAPSHOT/sequtils-0.92-SNAPSHOT.pom
[JENKINS] Archiving /media/ephemeral0/workspace/sequtils/target/sequtils-0.92-SNAPSHOT-sources.jar to /usr/share/apache-tomcat-7.0.22/.jenkins/jobs/sequtils/modules/edu.berkeley.compbio$sequtils/builds/2013-03-20_10-17-15/archive/edu.berkeley.compbio/sequtils/0.92-SNAPSHOT/sequtils-0.92-SNAPSHOT-sources.jar
Waiting for Jenkins to finish collecting data
mavenExecutionResult exceptions not empty
message : Failed to execute goal org.apache.maven.plugins:maven-surefire-plugin:2.12:test (default-test) on project sequtils: Error occurred in starting fork, check output in log
cause : Error occurred in starting fork, check output in log
Stack trace : 
org.apache.maven.lifecycle.LifecycleExecutionException: Failed to execute goal org.apache.maven.plugins:maven-surefire-plugin:2.12:test (default-test) on project sequtils: Error occurred in starting fork, check output in log
	at org.apache.maven.lifecycle.internal.MojoExecutor.execute(MojoExecutor.java:217)
	at org.apache.maven.lifecycle.internal.MojoExecutor.execute(MojoExecutor.java:153)
	at org.apache.maven.lifecycle.internal.MojoExecutor.execute(MojoExecutor.java:145)
	at org.apache.maven.lifecycle.internal.LifecycleModuleBuilder.buildProject(LifecycleModuleBuilder.java:84)
	at org.apache.maven.lifecycle.internal.LifecycleModuleBuilder.buildProject(LifecycleModuleBuilder.java:59)
	at org.apache.maven.lifecycle.internal.LifecycleStarter.singleThreadedBuild(LifecycleStarter.java:183)
	at org.apache.maven.lifecycle.internal.LifecycleStarter.execute(LifecycleStarter.java:161)
	at org.apache.maven.DefaultMaven.doExecute(DefaultMaven.java:320)
	at org.apache.maven.DefaultMaven.execute(DefaultMaven.java:156)
	at org.jvnet.hudson.maven3.launcher.Maven3Launcher.main(Maven3Launcher.java:79)
	at sun.reflect.NativeMethodAccessorImpl.invoke0(Native Method)
	at sun.reflect.NativeMethodAccessorImpl.invoke(NativeMethodAccessorImpl.java:39)
	at sun.reflect.DelegatingMethodAccessorImpl.invoke(DelegatingMethodAccessorImpl.java:25)
	at java.lang.reflect.Method.invoke(Method.java:597)
	at org.codehaus.plexus.classworlds.launcher.Launcher.launchStandard(Launcher.java:329)
	at org.codehaus.plexus.classworlds.launcher.Launcher.launch(Launcher.java:239)
	at org.jvnet.hudson.maven3.agent.Maven3Main.launch(Maven3Main.java:158)
	at hudson.maven.Maven3Builder.call(Maven3Builder.java:100)
	at hudson.maven.Maven3Builder.call(Maven3Builder.java:66)
	at hudson.remoting.UserRequest.perform(UserRequest.java:118)
	at hudson.remoting.UserRequest.perform(UserRequest.java:48)
	at hudson.remoting.Request$2.run(Request.java:326)
	at hudson.remoting.InterceptingExecutorService$1.call(InterceptingExecutorService.java:72)
	at java.util.concurrent.FutureTask$Sync.innerRun(FutureTask.java:303)
	at java.util.concurrent.FutureTask.run(FutureTask.java:138)
	at java.util.concurrent.ThreadPoolExecutor$Worker.runTask(ThreadPoolExecutor.java:886)
	at java.util.concurrent.ThreadPoolExecutor$Worker.run(ThreadPoolExecutor.java:908)
	at java.lang.Thread.run(Thread.java:662)
Caused by: org.apache.maven.plugin.MojoExecutionException: Error occurred in starting fork, check output in log
	at org.apache.maven.plugin.surefire.SurefirePlugin.assertNoException(SurefirePlugin.java:656)
	at org.apache.maven.plugin.surefire.SurefirePlugin.handleSummary(SurefirePlugin.java:645)
	at org.apache.maven.plugin.surefire.AbstractSurefireMojo.executeAfterPreconditionsChecked(AbstractSurefireMojo.java:137)
	at org.apache.maven.plugin.surefire.AbstractSurefireMojo.execute(AbstractSurefireMojo.java:98)
	at org.apache.maven.plugin.DefaultBuildPluginManager.executeMojo(DefaultBuildPluginManager.java:101)
	at org.apache.maven.lifecycle.internal.MojoExecutor.execute(MojoExecutor.java:209)
	... 27 more
Caused by: org.apache.maven.surefire.booter.SurefireBooterForkException: Error occurred in starting fork, check output in log
	at org.apache.maven.plugin.surefire.booterclient.ForkStarter.fork(ForkStarter.java:281)
	at org.apache.maven.plugin.surefire.booterclient.ForkStarter.run(ForkStarter.java:113)
	at org.apache.maven.plugin.surefire.AbstractSurefireMojo.executeProvider(AbstractSurefireMojo.java:199)
	at org.apache.maven.plugin.surefire.AbstractSurefireMojo.executeAllProviders(AbstractSurefireMojo.java:176)
	at org.apache.maven.plugin.surefire.AbstractSurefireMojo.executeAfterPreconditionsChecked(AbstractSurefireMojo.java:135)
	... 30 more
channel stopped
Sending e-mails to: dev@davidsoergel.com
Finished: FAILURE