FailedConsole Output

Started by user soergel
Building remotely on i-615a4d1e in workspace /media/ephemeral0/workspace/sequtils
$ hg clone --rev default --noupdate ssh://jenkins@dev.davidsoergel.com//home/hg/sequtils /media/ephemeral0/workspace/sequtils
adding changesets
adding manifests
adding file changes
added 222 changesets with 402 changes to 92 files
[sequtils] $ hg update --rev default
86 files updated, 0 files merged, 0 files removed, 0 files unresolved
[sequtils] $ hg log --rev . --template {node}
[sequtils] $ hg log --rev . --template {rev}
[sequtils] $ hg log --rev 7cfeb97f6487548ba21a28956765333ad0e35906
[sequtils] $ hg log --template "<changeset node='{node}' author='{author|xmlescape}' rev='{rev}' date='{date}'><msg>{desc|xmlescape}</msg><added>{file_adds|stringify|xmlescape}</added><deleted>{file_dels|stringify|xmlescape}</deleted><files>{files|stringify|xmlescape}</files><parents>{parents}</parents></changeset>\n" --rev default:0 --follow --prune 7cfeb97f6487548ba21a28956765333ad0e35906
Parsing POMs
[sequtils] $ java -Xmx1024M -XX:MaxPermSize=256M -cp /media/ephemeral0/maven3-agent.jar:/media/ephemeral0/tools/Maven/Maven_3.0.4/boot/plexus-classworlds-2.4.jar org.jvnet.hudson.maven3.agent.Maven3Main /media/ephemeral0/tools/Maven/Maven_3.0.4 /tmp/slave.jar /media/ephemeral0/maven3-interceptor.jar 37173
<===[JENKINS REMOTING CAPACITY]===>channel started
log4j:WARN No appenders could be found for logger (org.apache.commons.beanutils.converters.BooleanConverter).
log4j:WARN Please initialize the log4j system properly.
Executing Maven:  -B -f /media/ephemeral0/workspace/sequtils/pom.xml -U -e clean source:jar package jar:test-jar
[INFO] Error stacktraces are turned on.
[INFO] Scanning for projects...
Projects to build: [MavenProject: edu.berkeley.compbio:sequtils:0.92-SNAPSHOT @ /media/ephemeral0/workspace/sequtils/pom.xml]
Downloading: http://repo.maven.apache.org/maven2/org/codehaus/mojo/maven-metadata.xml
Downloading: http://dev.davidsoergel.com/nexus/content/groups/public/org/codehaus/mojo/maven-metadata.xml
Downloading: http://dev.davidsoergel.com/nexus/content/groups/public/org/apache/maven/plugins/maven-metadata.xml
Downloading: http://repo.maven.apache.org/maven2/org/apache/maven/plugins/maven-metadata.xml
Downloaded: http://repo.maven.apache.org/maven2/org/apache/maven/plugins/maven-metadata.xml (11 KB at 9.4 KB/sec)
Downloaded: http://repo.maven.apache.org/maven2/org/codehaus/mojo/maven-metadata.xml (21 KB at 18.5 KB/sec)
Downloaded: http://dev.davidsoergel.com/nexus/content/groups/public/org/apache/maven/plugins/maven-metadata.xml (11 KB at 9.9 KB/sec)
Downloaded: http://dev.davidsoergel.com/nexus/content/groups/public/org/codehaus/mojo/maven-metadata.xml (21 KB at 14.3 KB/sec)
Downloading: http://repo.maven.apache.org/maven2/org/apache/maven/plugins/maven-source-plugin/maven-metadata.xml
Downloading: http://dev.davidsoergel.com/nexus/content/groups/public/org/apache/maven/plugins/maven-source-plugin/maven-metadata.xml
Downloaded: http://dev.davidsoergel.com/nexus/content/groups/public/org/apache/maven/plugins/maven-source-plugin/maven-metadata.xml (692 B at 5.0 KB/sec)
Downloaded: http://repo.maven.apache.org/maven2/org/apache/maven/plugins/maven-source-plugin/maven-metadata.xml (692 B at 1.0 KB/sec)
Downloading: http://dev.davidsoergel.com/nexus/content/groups/public/org/apache/maven/plugins/maven-source-plugin/2.2.1/maven-source-plugin-2.2.1.pom
Downloaded: http://dev.davidsoergel.com/nexus/content/groups/public/org/apache/maven/plugins/maven-source-plugin/2.2.1/maven-source-plugin-2.2.1.pom (7 KB at 52.5 KB/sec)
Downloading: http://dev.davidsoergel.com/nexus/content/groups/public/org/apache/maven/plugins/maven-source-plugin/2.2.1/maven-source-plugin-2.2.1.jar
Downloaded: http://dev.davidsoergel.com/nexus/content/groups/public/org/apache/maven/plugins/maven-source-plugin/2.2.1/maven-source-plugin-2.2.1.jar (30 KB at 203.6 KB/sec)
projectStarted edu.berkeley.compbio:sequtils:0.92-SNAPSHOT
[INFO]                                                                         
[INFO] ------------------------------------------------------------------------
[INFO] Building sequtils 0.92-SNAPSHOT
[INFO] ------------------------------------------------------------------------
Downloading: http://dev.davidsoergel.com/nexus/content/groups/public/edu/berkeley/compbio/ml/0.92/ml-0.92.pom
Downloaded: http://dev.davidsoergel.com/nexus/content/groups/public/edu/berkeley/compbio/ml/0.92/ml-0.92.pom (7 KB at 46.6 KB/sec)
Downloading: http://dev.davidsoergel.com/nexus/content/groups/public/com/davidsoergel/runutils/0.91/runutils-0.91.pom
Downloaded: http://dev.davidsoergel.com/nexus/content/groups/public/com/davidsoergel/runutils/0.91/runutils-0.91.pom (5 KB at 40.1 KB/sec)
Downloading: http://dev.davidsoergel.com/nexus/content/groups/public/org/easymock/easymock/2.0/easymock-2.0.pom
Downloaded: http://dev.davidsoergel.com/nexus/content/groups/public/org/easymock/easymock/2.0/easymock-2.0.pom (2 KB at 7.3 KB/sec)
Downloading: http://dev.davidsoergel.com/nexus/content/groups/public/edu/berkeley/compbio/ml/0.92/ml-0.92.jar
Downloading: http://dev.davidsoergel.com/nexus/content/groups/public/com/davidsoergel/runutils/0.91/runutils-0.91.jar
Downloading: http://dev.davidsoergel.com/nexus/content/groups/public/org/easymock/easymock/2.0/easymock-2.0.jar
Downloaded: http://dev.davidsoergel.com/nexus/content/groups/public/edu/berkeley/compbio/ml/0.92/ml-0.92.jar (195 KB at 667.4 KB/sec)
Downloaded: http://dev.davidsoergel.com/nexus/content/groups/public/com/davidsoergel/runutils/0.91/runutils-0.91.jar (40 KB at 137.3 KB/sec)
Downloaded: http://dev.davidsoergel.com/nexus/content/groups/public/org/easymock/easymock/2.0/easymock-2.0.jar (59 KB at 163.3 KB/sec)
mojoStarted org.apache.maven.plugins:maven-clean-plugin:2.4.1(default-clean)
[INFO] 
[INFO] --- maven-clean-plugin:2.4.1:clean (default-clean) @ sequtils ---
mojoSucceeded org.apache.maven.plugins:maven-clean-plugin:2.4.1(default-clean)
mojoStarted org.codehaus.mojo:cobertura-maven-plugin:2.5.1(clean)
[INFO] 
[INFO] --- cobertura-maven-plugin:2.5.1:clean (clean) @ sequtils ---
mojoSucceeded org.codehaus.mojo:cobertura-maven-plugin:2.5.1(clean)
Dec 2, 2012 12:24:26 AM hudson.maven.ExecutedMojo <init>
WARNING: Failed to getClass for org.apache.maven.plugin.source.SourceJarMojo
mojoStarted org.apache.maven.plugins:maven-source-plugin:2.2.1(default-cli)
[INFO] 
[INFO] --- maven-source-plugin:2.2.1:jar (default-cli) @ sequtils ---
Downloading: http://dev.davidsoergel.com/nexus/content/groups/public/org/codehaus/plexus/plexus-archiver/2.2/plexus-archiver-2.2.pom
Downloaded: http://dev.davidsoergel.com/nexus/content/groups/public/org/codehaus/plexus/plexus-archiver/2.2/plexus-archiver-2.2.pom (4 KB at 4.6 KB/sec)
Downloading: http://dev.davidsoergel.com/nexus/content/groups/public/org/codehaus/plexus/plexus-utils/3.0.7/plexus-utils-3.0.7.pom
Downloaded: http://dev.davidsoergel.com/nexus/content/groups/public/org/codehaus/plexus/plexus-utils/3.0.7/plexus-utils-3.0.7.pom (3 KB at 5.0 KB/sec)
Downloading: http://dev.davidsoergel.com/nexus/content/groups/public/org/codehaus/plexus/plexus-utils/3.0.8/plexus-utils-3.0.8.pom
Downloaded: http://dev.davidsoergel.com/nexus/content/groups/public/org/codehaus/plexus/plexus-utils/3.0.8/plexus-utils-3.0.8.pom (4 KB at 10.3 KB/sec)
Downloading: http://dev.davidsoergel.com/nexus/content/groups/public/org/codehaus/plexus/plexus/3.2/plexus-3.2.pom
Downloaded: http://dev.davidsoergel.com/nexus/content/groups/public/org/codehaus/plexus/plexus/3.2/plexus-3.2.pom (19 KB at 134.6 KB/sec)
Downloading: http://dev.davidsoergel.com/nexus/content/groups/public/org/codehaus/plexus/plexus-interpolation/1.15/plexus-interpolation-1.15.jar
Downloading: http://dev.davidsoergel.com/nexus/content/groups/public/org/codehaus/plexus/plexus-utils/3.0.8/plexus-utils-3.0.8.jar
Downloading: http://dev.davidsoergel.com/nexus/content/groups/public/org/codehaus/plexus/plexus-archiver/2.2/plexus-archiver-2.2.jar
Downloaded: http://dev.davidsoergel.com/nexus/content/groups/public/org/codehaus/plexus/plexus-interpolation/1.15/plexus-interpolation-1.15.jar (60 KB at 233.4 KB/sec)
Downloaded: http://dev.davidsoergel.com/nexus/content/groups/public/org/codehaus/plexus/plexus-archiver/2.2/plexus-archiver-2.2.jar (181 KB at 468.0 KB/sec)
Downloaded: http://dev.davidsoergel.com/nexus/content/groups/public/org/codehaus/plexus/plexus-utils/3.0.8/plexus-utils-3.0.8.jar (227 KB at 566.0 KB/sec)
[INFO] Building jar: /media/ephemeral0/workspace/sequtils/target/sequtils-0.92-SNAPSHOT-sources.jar
mojoSucceeded org.apache.maven.plugins:maven-source-plugin:2.2.1(default-cli)
mojoStarted org.apache.maven.plugins:maven-resources-plugin:2.5(default-resources)
[INFO] 
[INFO] --- maven-resources-plugin:2.5:resources (default-resources) @ sequtils ---
[debug] execute contextualize
[INFO] Using 'UTF-8' encoding to copy filtered resources.
[INFO] skip non existing resourceDirectory /media/ephemeral0/workspace/sequtils/src/main/resources
mojoSucceeded org.apache.maven.plugins:maven-resources-plugin:2.5(default-resources)
mojoStarted org.apache.maven.plugins:maven-compiler-plugin:2.4(default-compile)
[INFO] 
[INFO] --- maven-compiler-plugin:2.4:compile (default-compile) @ sequtils ---
[INFO] Compiling 66 source files to /media/ephemeral0/workspace/sequtils/target/classes
[INFO] -------------------------------------------------------------
[ERROR] COMPILATION ERROR : 
[INFO] -------------------------------------------------------------
[ERROR] Failure executing javac, but could not parse the error:
javac: invalid target release: 1.7
Usage: javac <options> <source files>
use -help for a list of possible options

[INFO] 1 error
[INFO] -------------------------------------------------------------
mojoFailed org.apache.maven.plugins:maven-compiler-plugin:2.4(default-compile)
projectFailed edu.berkeley.compbio:sequtils:0.92-SNAPSHOT
sessionEnded
[INFO] ------------------------------------------------------------------------
[INFO] BUILD FAILURE
[INFO] ------------------------------------------------------------------------
[INFO] Total time: 57.260s
[INFO] Finished at: Sun Dec 02 00:24:35 UTC 2012
[INFO] Final Memory: 10M/25M
[INFO] ------------------------------------------------------------------------
Projects to build: [MavenProject: edu.berkeley.compbio:sequtils:0.92-SNAPSHOT @ /media/ephemeral0/workspace/sequtils/pom.xml]
[JENKINS] Archiving /media/ephemeral0/workspace/sequtils/pom.xml to /usr/share/apache-tomcat-7.0.22/.jenkins/jobs/sequtils/modules/edu.berkeley.compbio$sequtils/builds/2012-12-01_19-23-06/archive/edu.berkeley.compbio/sequtils/0.92-SNAPSHOT/sequtils-0.92-SNAPSHOT.pom
[JENKINS] Archiving /media/ephemeral0/workspace/sequtils/target/sequtils-0.92-SNAPSHOT-sources.jar to /usr/share/apache-tomcat-7.0.22/.jenkins/jobs/sequtils/modules/edu.berkeley.compbio$sequtils/builds/2012-12-01_19-23-06/archive/edu.berkeley.compbio/sequtils/0.92-SNAPSHOT/sequtils-0.92-SNAPSHOT-sources.jar
Waiting for Jenkins to finish collecting data
mavenExecutionResult exceptions not empty
message : Failed to execute goal org.apache.maven.plugins:maven-compiler-plugin:2.4:compile (default-compile) on project sequtils: Compilation failure
Failure executing javac, but could not parse the error:
javac: invalid target release: 1.7
Usage: javac <options> <source files>
use -help for a list of possible options


cause : Compilation failure
Failure executing javac, but could not parse the error:
javac: invalid target release: 1.7
Usage: javac <options> <source files>
use -help for a list of possible options


Stack trace : 
org.apache.maven.lifecycle.LifecycleExecutionException: Failed to execute goal org.apache.maven.plugins:maven-compiler-plugin:2.4:compile (default-compile) on project sequtils: Compilation failure
Failure executing javac, but could not parse the error:
javac: invalid target release: 1.7
Usage: javac <options> <source files>
use -help for a list of possible options


	at org.apache.maven.lifecycle.internal.MojoExecutor.execute(MojoExecutor.java:213)
	at org.apache.maven.lifecycle.internal.MojoExecutor.execute(MojoExecutor.java:153)
	at org.apache.maven.lifecycle.internal.MojoExecutor.execute(MojoExecutor.java:145)
	at org.apache.maven.lifecycle.internal.LifecycleModuleBuilder.buildProject(LifecycleModuleBuilder.java:84)
	at org.apache.maven.lifecycle.internal.LifecycleModuleBuilder.buildProject(LifecycleModuleBuilder.java:59)
	at org.apache.maven.lifecycle.internal.LifecycleStarter.singleThreadedBuild(LifecycleStarter.java:183)
	at org.apache.maven.lifecycle.internal.LifecycleStarter.execute(LifecycleStarter.java:161)
	at org.apache.maven.DefaultMaven.doExecute(DefaultMaven.java:320)
	at org.apache.maven.DefaultMaven.execute(DefaultMaven.java:156)
	at org.jvnet.hudson.maven3.launcher.Maven3Launcher.main(Maven3Launcher.java:79)
	at sun.reflect.NativeMethodAccessorImpl.invoke0(Native Method)
	at sun.reflect.NativeMethodAccessorImpl.invoke(NativeMethodAccessorImpl.java:39)
	at sun.reflect.DelegatingMethodAccessorImpl.invoke(DelegatingMethodAccessorImpl.java:25)
	at java.lang.reflect.Method.invoke(Method.java:597)
	at org.codehaus.plexus.classworlds.launcher.Launcher.launchStandard(Launcher.java:329)
	at org.codehaus.plexus.classworlds.launcher.Launcher.launch(Launcher.java:239)
	at org.jvnet.hudson.maven3.agent.Maven3Main.launch(Maven3Main.java:158)
	at hudson.maven.Maven3Builder.call(Maven3Builder.java:98)
	at hudson.maven.Maven3Builder.call(Maven3Builder.java:64)
	at hudson.remoting.UserRequest.perform(UserRequest.java:118)
	at hudson.remoting.UserRequest.perform(UserRequest.java:48)
	at hudson.remoting.Request$2.run(Request.java:326)
	at hudson.remoting.InterceptingExecutorService$1.call(InterceptingExecutorService.java:72)
	at java.util.concurrent.FutureTask$Sync.innerRun(FutureTask.java:303)
	at java.util.concurrent.FutureTask.run(FutureTask.java:138)
	at java.util.concurrent.ThreadPoolExecutor$Worker.runTask(ThreadPoolExecutor.java:886)
	at java.util.concurrent.ThreadPoolExecutor$Worker.run(ThreadPoolExecutor.java:908)
	at java.lang.Thread.run(Thread.java:662)
Caused by: org.apache.maven.plugin.CompilationFailureException: Compilation failure
Failure executing javac, but could not parse the error:
javac: invalid target release: 1.7
Usage: javac <options> <source files>
use -help for a list of possible options


	at org.apache.maven.plugin.AbstractCompilerMojo.execute(AbstractCompilerMojo.java:678)
	at org.apache.maven.plugin.CompilerMojo.execute(CompilerMojo.java:128)
	at org.apache.maven.plugin.DefaultBuildPluginManager.executeMojo(DefaultBuildPluginManager.java:101)
	at org.apache.maven.lifecycle.internal.MojoExecutor.execute(MojoExecutor.java:209)
	... 27 more
channel stopped
Sending e-mails to: dev@davidsoergel.com
Finished: FAILURE