FailedConsole Output

Started by an SCM change
Building remotely on i-24df0d4c in workspace /media/ephemeral0/workspace/phyloutils
$ hg clone --rev default --noupdate ssh://jenkins@dev.davidsoergel.com//home/hg/phyloutils /media/ephemeral0/workspace/phyloutils
adding changesets
adding manifests
adding file changes
added 421 changesets with 1531 changes to 131 files
[phyloutils] $ hg update --rev default
58 files updated, 0 files merged, 0 files removed, 0 files unresolved
[phyloutils] $ hg log --rev . --template {node}
[phyloutils] $ hg log --rev . --template {rev}
[phyloutils] $ hg log --rev 8b51f7b4cdf8179d62738d3b60ac120b19948d4a
[phyloutils] $ hg log --template "<changeset node='{node}' author='{author|xmlescape}' rev='{rev}' date='{date}'><msg>{desc|xmlescape}</msg><added>{file_adds|stringify|xmlescape}</added><deleted>{file_dels|stringify|xmlescape}</deleted><files>{files|stringify|xmlescape}</files><parents>{parents}</parents></changeset>\n" --rev default:0 --follow --prune 8b51f7b4cdf8179d62738d3b60ac120b19948d4a
Parsing POMs
Modules changed, recalculating dependency graph
[phyloutils] $ java -Xmx1024M -XX:MaxPermSize=256M -cp /media/ephemeral0/maven3-agent.jar:/media/ephemeral0/tools/hudson.tasks.Maven_MavenInstallation/Maven_3.0.4/boot/plexus-classworlds-2.4.jar org.jvnet.hudson.maven3.agent.Maven3Main /media/ephemeral0/tools/hudson.tasks.Maven_MavenInstallation/Maven_3.0.4 /tmp/slave.jar /media/ephemeral0/maven3-interceptor.jar 51070
<===[JENKINS REMOTING CAPACITY]===>channel started
log4j:WARN No appenders could be found for logger (org.apache.commons.beanutils.converters.BooleanConverter).
log4j:WARN Please initialize the log4j system properly.
Executing Maven:  -B -f /media/ephemeral0/workspace/phyloutils/pom.xml -U -e clean source:jar package jar:test-jar
[INFO] Error stacktraces are turned on.
[INFO] Scanning for projects...
Downloading: http://dev.davidsoergel.com/nexus/content/groups/public/org/codehaus/mojo/maven-metadata.xml
Downloading: http://repo.maven.apache.org/maven2/org/apache/maven/plugins/maven-metadata.xml
Downloading: http://repo.maven.apache.org/maven2/org/codehaus/mojo/maven-metadata.xml
Downloading: http://dev.davidsoergel.com/nexus/content/groups/public/org/apache/maven/plugins/maven-metadata.xml
Downloaded: http://repo.maven.apache.org/maven2/org/apache/maven/plugins/maven-metadata.xml (11 KB at 10.3 KB/sec)
Downloaded: http://dev.davidsoergel.com/nexus/content/groups/public/org/apache/maven/plugins/maven-metadata.xml (11 KB at 8.8 KB/sec)
Downloaded: http://dev.davidsoergel.com/nexus/content/groups/public/org/codehaus/mojo/maven-metadata.xml (22 KB at 17.0 KB/sec)
Downloaded: http://repo.maven.apache.org/maven2/org/codehaus/mojo/maven-metadata.xml (22 KB at 16.0 KB/sec)
Downloading: http://dev.davidsoergel.com/nexus/content/groups/public/org/apache/maven/plugins/maven-source-plugin/maven-metadata.xml
Downloading: http://repo.maven.apache.org/maven2/org/apache/maven/plugins/maven-source-plugin/maven-metadata.xml
Downloaded: http://repo.maven.apache.org/maven2/org/apache/maven/plugins/maven-source-plugin/maven-metadata.xml (692 B at 33.8 KB/sec)
Downloaded: http://dev.davidsoergel.com/nexus/content/groups/public/org/apache/maven/plugins/maven-source-plugin/maven-metadata.xml (692 B at 5.0 KB/sec)
[INFO]                                                                         
[INFO] ------------------------------------------------------------------------
[INFO] Building phyloutils 0.93-SNAPSHOT
[INFO] ------------------------------------------------------------------------
Downloading: http://dev.davidsoergel.com/nexus/content/groups/public/com/davidsoergel/conja/1.051/conja-1.051.pom
Downloaded: http://dev.davidsoergel.com/nexus/content/groups/public/com/davidsoergel/conja/1.051/conja-1.051.pom (4 KB at 15.2 KB/sec)
Downloading: http://dev.davidsoergel.com/nexus/content/groups/public/com/davidsoergel/basepom/0.95/basepom-0.95.pom
Downloaded: http://dev.davidsoergel.com/nexus/content/groups/public/com/davidsoergel/basepom/0.95/basepom-0.95.pom (9 KB at 45.1 KB/sec)
Downloading: http://dev.davidsoergel.com/nexus/content/groups/public/log4j/log4j/1.2.13/log4j-1.2.13.pom
Downloaded: http://dev.davidsoergel.com/nexus/content/groups/public/log4j/log4j/1.2.13/log4j-1.2.13.pom (389 B at 2.7 KB/sec)
Downloading: http://dev.davidsoergel.com/nexus/content/groups/public/com/caucho/hessian/3.1.3/hessian-3.1.3.pom
Downloaded: http://dev.davidsoergel.com/nexus/content/groups/public/com/caucho/hessian/3.1.3/hessian-3.1.3.pom (623 B at 0.1 KB/sec)
Downloading: http://dev.davidsoergel.com/nexus/content/groups/public/org/springframework/spring/3.1.3.RELEASE/spring-3.1.3.RELEASE.pom
Downloading: http://repo.maven.apache.org/maven2/org/springframework/spring/3.1.3.RELEASE/spring-3.1.3.RELEASE.pom
[WARNING] The POM for org.springframework:spring:jar:3.1.3.RELEASE is missing, no dependency information available
Downloading: http://dev.davidsoergel.com/nexus/content/groups/public/org/springframework/spring-mock/2.0.8/spring-mock-2.0.8.pom
Downloaded: http://dev.davidsoergel.com/nexus/content/groups/public/org/springframework/spring-mock/2.0.8/spring-mock-2.0.8.pom (5 KB at 21.6 KB/sec)
Downloading: http://dev.davidsoergel.com/nexus/content/groups/public/hsqldb/hsqldb/1.8.0.10/hsqldb-1.8.0.10.pom
Downloaded: http://dev.davidsoergel.com/nexus/content/groups/public/hsqldb/hsqldb/1.8.0.10/hsqldb-1.8.0.10.pom (600 B at 7.7 KB/sec)
Downloading: http://dev.davidsoergel.com/nexus/content/groups/public/mysql/mysql-connector-java/5.1.24/mysql-connector-java-5.1.24.pom
Downloaded: http://dev.davidsoergel.com/nexus/content/groups/public/mysql/mysql-connector-java/5.1.24/mysql-connector-java-5.1.24.pom (2 KB at 11.9 KB/sec)
Downloading: http://dev.davidsoergel.com/nexus/content/groups/public/com/davidsoergel/conja/1.051/conja-1.051.jar
Downloading: http://dev.davidsoergel.com/nexus/content/groups/public/log4j/log4j/1.2.13/log4j-1.2.13.jar
Downloading: http://dev.davidsoergel.com/nexus/content/groups/public/com/caucho/hessian/3.1.3/hessian-3.1.3.jar
Downloading: http://dev.davidsoergel.com/nexus/content/groups/public/org/springframework/spring/3.1.3.RELEASE/spring-3.1.3.RELEASE.jar
Downloading: http://dev.davidsoergel.com/nexus/content/groups/public/org/springframework/spring-mock/2.0.8/spring-mock-2.0.8.jar
Downloaded: http://dev.davidsoergel.com/nexus/content/groups/public/com/davidsoergel/conja/1.051/conja-1.051.jar (30 KB at 10.9 KB/sec)
Downloading: http://dev.davidsoergel.com/nexus/content/groups/public/hsqldb/hsqldb/1.8.0.10/hsqldb-1.8.0.10.jar
Downloaded: http://dev.davidsoergel.com/nexus/content/groups/public/log4j/log4j/1.2.13/log4j-1.2.13.jar (350 KB at 124.0 KB/sec)
Downloading: http://dev.davidsoergel.com/nexus/content/groups/public/mysql/mysql-connector-java/5.1.24/mysql-connector-java-5.1.24.jar
Downloaded: http://dev.davidsoergel.com/nexus/content/groups/public/com/caucho/hessian/3.1.3/hessian-3.1.3.jar (267 KB at 93.2 KB/sec)
Downloaded: http://dev.davidsoergel.com/nexus/content/groups/public/org/springframework/spring-mock/2.0.8/spring-mock-2.0.8.jar (102 KB at 28.2 KB/sec)
Downloaded: http://dev.davidsoergel.com/nexus/content/groups/public/mysql/mysql-connector-java/5.1.24/mysql-connector-java-5.1.24.jar (827 KB at 761.0 KB/sec)
Downloaded: http://dev.davidsoergel.com/nexus/content/groups/public/hsqldb/hsqldb/1.8.0.10/hsqldb-1.8.0.10.jar (691 KB at 558.4 KB/sec)
Downloading: http://repo.maven.apache.org/maven2/org/springframework/spring/3.1.3.RELEASE/spring-3.1.3.RELEASE.jar
[INFO] ------------------------------------------------------------------------
[INFO] BUILD FAILURE
[INFO] ------------------------------------------------------------------------
[INFO] Total time: 29.933s
[INFO] Finished at: Wed Mar 20 20:34:11 UTC 2013
[INFO] Final Memory: 7M/25M
[INFO] ------------------------------------------------------------------------
[JENKINS] Archiving /media/ephemeral0/workspace/phyloutils/pom.xml to /usr/share/apache-tomcat-7.0.22/.jenkins/jobs/phyloutils/modules/edu.berkeley.compbio$phyloutils/builds/2013-03-20_16-33-27/archive/edu.berkeley.compbio/phyloutils/0.93-SNAPSHOT/phyloutils-0.93-SNAPSHOT.pom
Waiting for Jenkins to finish collecting data
mavenExecutionResult exceptions not empty
message : Failed to execute goal on project phyloutils: Could not resolve dependencies for project edu.berkeley.compbio:phyloutils:jar:0.93-SNAPSHOT: Could not find artifact org.springframework:spring:jar:3.1.3.RELEASE in dev.davidsoergel.com (http://dev.davidsoergel.com/nexus/content/groups/public)
cause : Could not resolve dependencies for project edu.berkeley.compbio:phyloutils:jar:0.93-SNAPSHOT: Could not find artifact org.springframework:spring:jar:3.1.3.RELEASE in dev.davidsoergel.com (http://dev.davidsoergel.com/nexus/content/groups/public)
Stack trace : 
org.apache.maven.lifecycle.LifecycleExecutionException: Failed to execute goal on project phyloutils: Could not resolve dependencies for project edu.berkeley.compbio:phyloutils:jar:0.93-SNAPSHOT: Could not find artifact org.springframework:spring:jar:3.1.3.RELEASE in dev.davidsoergel.com (http://dev.davidsoergel.com/nexus/content/groups/public)
	at org.apache.maven.lifecycle.internal.LifecycleDependencyResolver.getDependencies(LifecycleDependencyResolver.java:210)
	at org.apache.maven.lifecycle.internal.LifecycleDependencyResolver.resolveProjectDependencies(LifecycleDependencyResolver.java:117)
	at org.apache.maven.lifecycle.internal.MojoExecutor.ensureDependenciesAreResolved(MojoExecutor.java:258)
	at org.apache.maven.lifecycle.internal.MojoExecutor.execute(MojoExecutor.java:201)
	at org.apache.maven.lifecycle.internal.MojoExecutor.execute(MojoExecutor.java:153)
	at org.apache.maven.lifecycle.internal.MojoExecutor.execute(MojoExecutor.java:145)
	at org.apache.maven.lifecycle.internal.LifecycleModuleBuilder.buildProject(LifecycleModuleBuilder.java:84)
	at org.apache.maven.lifecycle.internal.LifecycleModuleBuilder.buildProject(LifecycleModuleBuilder.java:59)
	at org.apache.maven.lifecycle.internal.LifecycleStarter.singleThreadedBuild(LifecycleStarter.java:183)
	at org.apache.maven.lifecycle.internal.LifecycleStarter.execute(LifecycleStarter.java:161)
	at org.apache.maven.DefaultMaven.doExecute(DefaultMaven.java:320)
	at org.apache.maven.DefaultMaven.execute(DefaultMaven.java:156)
	at org.jvnet.hudson.maven3.launcher.Maven3Launcher.main(Maven3Launcher.java:79)
	at sun.reflect.NativeMethodAccessorImpl.invoke0(Native Method)
	at sun.reflect.NativeMethodAccessorImpl.invoke(NativeMethodAccessorImpl.java:39)
	at sun.reflect.DelegatingMethodAccessorImpl.invoke(DelegatingMethodAccessorImpl.java:25)
	at java.lang.reflect.Method.invoke(Method.java:597)
	at org.codehaus.plexus.classworlds.launcher.Launcher.launchStandard(Launcher.java:329)
	at org.codehaus.plexus.classworlds.launcher.Launcher.launch(Launcher.java:239)
	at org.jvnet.hudson.maven3.agent.Maven3Main.launch(Maven3Main.java:158)
	at hudson.maven.Maven3Builder.call(Maven3Builder.java:100)
	at hudson.maven.Maven3Builder.call(Maven3Builder.java:66)
	at hudson.remoting.UserRequest.perform(UserRequest.java:118)
	at hudson.remoting.UserRequest.perform(UserRequest.java:48)
	at hudson.remoting.Request$2.run(Request.java:326)
	at hudson.remoting.InterceptingExecutorService$1.call(InterceptingExecutorService.java:72)
	at java.util.concurrent.FutureTask$Sync.innerRun(FutureTask.java:303)
	at java.util.concurrent.FutureTask.run(FutureTask.java:138)
	at java.util.concurrent.ThreadPoolExecutor$Worker.runTask(ThreadPoolExecutor.java:886)
	at java.util.concurrent.ThreadPoolExecutor$Worker.run(ThreadPoolExecutor.java:908)
	at java.lang.Thread.run(Thread.java:662)
Caused by: org.apache.maven.project.DependencyResolutionException: Could not resolve dependencies for project edu.berkeley.compbio:phyloutils:jar:0.93-SNAPSHOT: Could not find artifact org.springframework:spring:jar:3.1.3.RELEASE in dev.davidsoergel.com (http://dev.davidsoergel.com/nexus/content/groups/public)
	at org.apache.maven.project.DefaultProjectDependenciesResolver.resolve(DefaultProjectDependenciesResolver.java:189)
	at org.apache.maven.lifecycle.internal.LifecycleDependencyResolver.getDependencies(LifecycleDependencyResolver.java:185)
	... 30 more
Caused by: org.sonatype.aether.resolution.DependencyResolutionException: Could not find artifact org.springframework:spring:jar:3.1.3.RELEASE in dev.davidsoergel.com (http://dev.davidsoergel.com/nexus/content/groups/public)
	at org.sonatype.aether.impl.internal.DefaultRepositorySystem.resolveDependencies(DefaultRepositorySystem.java:375)
	at org.apache.maven.project.DefaultProjectDependenciesResolver.resolve(DefaultProjectDependenciesResolver.java:183)
	... 31 more
Caused by: org.sonatype.aether.resolution.ArtifactResolutionException: Could not find artifact org.springframework:spring:jar:3.1.3.RELEASE in dev.davidsoergel.com (http://dev.davidsoergel.com/nexus/content/groups/public)
	at org.sonatype.aether.impl.internal.DefaultArtifactResolver.resolve(DefaultArtifactResolver.java:538)
	at org.sonatype.aether.impl.internal.DefaultArtifactResolver.resolveArtifacts(DefaultArtifactResolver.java:216)
	at org.sonatype.aether.impl.internal.DefaultRepositorySystem.resolveDependencies(DefaultRepositorySystem.java:358)
	... 32 more
Caused by: org.sonatype.aether.transfer.ArtifactNotFoundException: Could not find artifact org.springframework:spring:jar:3.1.3.RELEASE in dev.davidsoergel.com (http://dev.davidsoergel.com/nexus/content/groups/public)
	at org.sonatype.aether.connector.wagon.WagonRepositoryConnector$4.wrap(WagonRepositoryConnector.java:947)
	at org.sonatype.aether.connector.wagon.WagonRepositoryConnector$4.wrap(WagonRepositoryConnector.java:941)
	at org.sonatype.aether.connector.wagon.WagonRepositoryConnector$GetTask.run(WagonRepositoryConnector.java:669)
	at org.sonatype.aether.util.concurrency.RunnableErrorForwarder$1.run(RunnableErrorForwarder.java:60)
	... 3 more
channel stopped
Sending e-mails to: dev@davidsoergel.com
Finished: FAILURE