FailedConsole Output

Started by user soergel
Building remotely on i-655a4d1a in workspace /media/ephemeral0/workspace/phyloutils
$ hg clone --rev default --noupdate ssh://jenkins@dev.davidsoergel.com//home/hg/phyloutils /media/ephemeral0/workspace/phyloutils
adding changesets
adding manifests
adding file changes
added 418 changesets with 1527 changes to 131 files
[phyloutils] $ hg update --rev default
58 files updated, 0 files merged, 0 files removed, 0 files unresolved
[phyloutils] $ hg log --rev . --template {node}
[phyloutils] $ hg log --rev . --template {rev}
[phyloutils] $ hg log --rev 2c3358d36d20d42752ad70bf54b2352bf4f99894
[phyloutils] $ hg log --template "<changeset node='{node}' author='{author|xmlescape}' rev='{rev}' date='{date}'><msg>{desc|xmlescape}</msg><added>{file_adds|stringify|xmlescape}</added><deleted>{file_dels|stringify|xmlescape}</deleted><files>{files|stringify|xmlescape}</files><parents>{parents}</parents></changeset>\n" --rev default:0 --follow --prune 2c3358d36d20d42752ad70bf54b2352bf4f99894
Parsing POMs
[phyloutils] $ java -Xmx1024M -XX:MaxPermSize=256M -cp /media/ephemeral0/maven3-agent.jar:/media/ephemeral0/tools/Maven/Maven_3.0.4/boot/plexus-classworlds-2.4.jar org.jvnet.hudson.maven3.agent.Maven3Main /media/ephemeral0/tools/Maven/Maven_3.0.4 /tmp/slave.jar /media/ephemeral0/maven3-interceptor.jar 51378
<===[JENKINS REMOTING CAPACITY]===>channel started
log4j:WARN No appenders could be found for logger (org.apache.commons.beanutils.converters.BooleanConverter).
log4j:WARN Please initialize the log4j system properly.
Executing Maven:  -B -f /media/ephemeral0/workspace/phyloutils/pom.xml -U -e clean source:jar package jar:test-jar
[INFO] Error stacktraces are turned on.
[INFO] Scanning for projects...
Projects to build: [MavenProject: edu.berkeley.compbio:phyloutils:0.93-SNAPSHOT @ /media/ephemeral0/workspace/phyloutils/pom.xml]
Downloading: http://repo.maven.apache.org/maven2/org/apache/maven/plugins/maven-metadata.xml
Downloading: http://dev.davidsoergel.com/nexus/content/groups/public/org/codehaus/mojo/maven-metadata.xml
Downloading: http://dev.davidsoergel.com/nexus/content/groups/public/org/apache/maven/plugins/maven-metadata.xml
Downloading: http://repo.maven.apache.org/maven2/org/codehaus/mojo/maven-metadata.xml
Downloaded: http://repo.maven.apache.org/maven2/org/apache/maven/plugins/maven-metadata.xml (11 KB at 13.0 KB/sec)
Downloaded: http://repo.maven.apache.org/maven2/org/codehaus/mojo/maven-metadata.xml (21 KB at 25.7 KB/sec)
Downloaded: http://dev.davidsoergel.com/nexus/content/groups/public/org/apache/maven/plugins/maven-metadata.xml (11 KB at 2.7 KB/sec)
Downloaded: http://dev.davidsoergel.com/nexus/content/groups/public/org/codehaus/mojo/maven-metadata.xml (21 KB at 5.3 KB/sec)
Downloading: http://dev.davidsoergel.com/nexus/content/groups/public/org/apache/maven/plugins/maven-source-plugin/maven-metadata.xml
Downloading: http://repo.maven.apache.org/maven2/org/apache/maven/plugins/maven-source-plugin/maven-metadata.xml
Downloaded: http://repo.maven.apache.org/maven2/org/apache/maven/plugins/maven-source-plugin/maven-metadata.xml (692 B at 48.3 KB/sec)
Downloaded: http://dev.davidsoergel.com/nexus/content/groups/public/org/apache/maven/plugins/maven-source-plugin/maven-metadata.xml (692 B at 5.3 KB/sec)
projectStarted edu.berkeley.compbio:phyloutils:0.93-SNAPSHOT
[INFO]                                                                         
[INFO] ------------------------------------------------------------------------
[INFO] Building phyloutils 0.93-SNAPSHOT
[INFO] ------------------------------------------------------------------------
Downloading: http://dev.davidsoergel.com/nexus/content/groups/public/com/caucho/hessian/3.1.3/hessian-3.1.3.pom
Downloaded: http://dev.davidsoergel.com/nexus/content/groups/public/com/caucho/hessian/3.1.3/hessian-3.1.3.pom (623 B at 5.1 KB/sec)
Downloading: http://dev.davidsoergel.com/nexus/content/groups/public/org/springframework/spring/2.5.6/spring-2.5.6.pom
Downloaded: http://dev.davidsoergel.com/nexus/content/groups/public/org/springframework/spring/2.5.6/spring-2.5.6.pom (13 KB at 27.7 KB/sec)
Downloading: http://dev.davidsoergel.com/nexus/content/groups/public/org/springframework/spring-mock/2.0.2/spring-mock-2.0.2.pom
Downloaded: http://dev.davidsoergel.com/nexus/content/groups/public/org/springframework/spring-mock/2.0.2/spring-mock-2.0.2.pom (5 KB at 9.3 KB/sec)
Downloading: http://dev.davidsoergel.com/nexus/content/groups/public/commons-logging/commons-logging/1.1/commons-logging-1.1.pom
Downloaded: http://dev.davidsoergel.com/nexus/content/groups/public/commons-logging/commons-logging/1.1/commons-logging-1.1.pom (7 KB at 2.7 KB/sec)
Downloading: http://dev.davidsoergel.com/nexus/content/groups/public/log4j/log4j/1.2.12/log4j-1.2.12.pom
Downloaded: http://dev.davidsoergel.com/nexus/content/groups/public/log4j/log4j/1.2.12/log4j-1.2.12.pom (145 B at 1.0 KB/sec)
Downloading: http://dev.davidsoergel.com/nexus/content/groups/public/logkit/logkit/1.0.1/logkit-1.0.1.pom
Downloaded: http://dev.davidsoergel.com/nexus/content/groups/public/logkit/logkit/1.0.1/logkit-1.0.1.pom (147 B at 0.2 KB/sec)
Downloading: http://dev.davidsoergel.com/nexus/content/groups/public/avalon-framework/avalon-framework/4.1.3/avalon-framework-4.1.3.pom
Downloaded: http://dev.davidsoergel.com/nexus/content/groups/public/avalon-framework/avalon-framework/4.1.3/avalon-framework-4.1.3.pom (167 B at 0.4 KB/sec)
Downloading: http://dev.davidsoergel.com/nexus/content/groups/public/javax/servlet/servlet-api/2.3/servlet-api-2.3.pom
Downloaded: http://dev.davidsoergel.com/nexus/content/groups/public/javax/servlet/servlet-api/2.3/servlet-api-2.3.pom (156 B at 1.6 KB/sec)
Downloading: http://dev.davidsoergel.com/nexus/content/groups/public/hsqldb/hsqldb/1.8.0.1/hsqldb-1.8.0.1.pom
Downloaded: http://dev.davidsoergel.com/nexus/content/groups/public/hsqldb/hsqldb/1.8.0.1/hsqldb-1.8.0.1.pom (148 B at 0.6 KB/sec)
Downloading: http://dev.davidsoergel.com/nexus/content/groups/public/mysql/mysql-connector-java/5.0.4/mysql-connector-java-5.0.4.pom
Downloaded: http://dev.davidsoergel.com/nexus/content/groups/public/mysql/mysql-connector-java/5.0.4/mysql-connector-java-5.0.4.pom (2 KB at 2.2 KB/sec)
Downloading: http://dev.davidsoergel.com/nexus/content/groups/public/com/caucho/hessian/3.1.3/hessian-3.1.3.jar
Downloading: http://dev.davidsoergel.com/nexus/content/groups/public/org/springframework/spring/2.5.6/spring-2.5.6.jar
Downloading: http://dev.davidsoergel.com/nexus/content/groups/public/com/davidsoergel/trees/1.03/trees-1.03-tests.jar
Downloading: http://dev.davidsoergel.com/nexus/content/groups/public/org/springframework/spring-mock/2.0.2/spring-mock-2.0.2.jar
Downloading: http://dev.davidsoergel.com/nexus/content/groups/public/hsqldb/hsqldb/1.8.0.1/hsqldb-1.8.0.1.jar
Downloaded: http://dev.davidsoergel.com/nexus/content/groups/public/com/davidsoergel/trees/1.03/trees-1.03-tests.jar (28 KB at 88.8 KB/sec)
Downloading: http://dev.davidsoergel.com/nexus/content/groups/public/mysql/mysql-connector-java/5.0.4/mysql-connector-java-5.0.4.jar
Downloaded: http://dev.davidsoergel.com/nexus/content/groups/public/org/springframework/spring-mock/2.0.2/spring-mock-2.0.2.jar (98 KB at 216.1 KB/sec)
Downloaded: http://dev.davidsoergel.com/nexus/content/groups/public/com/caucho/hessian/3.1.3/hessian-3.1.3.jar (267 KB at 445.2 KB/sec)
Downloaded: http://dev.davidsoergel.com/nexus/content/groups/public/hsqldb/hsqldb/1.8.0.1/hsqldb-1.8.0.1.jar (611 KB at 845.5 KB/sec)
Downloaded: http://dev.davidsoergel.com/nexus/content/groups/public/mysql/mysql-connector-java/5.0.4/mysql-connector-java-5.0.4.jar (485 KB at 933.2 KB/sec)
Downloaded: http://dev.davidsoergel.com/nexus/content/groups/public/org/springframework/spring/2.5.6/spring-2.5.6.jar (2881 KB at 2441.0 KB/sec)
mojoStarted org.apache.maven.plugins:maven-clean-plugin:2.4.1(default-clean)
[INFO] 
[INFO] --- maven-clean-plugin:2.4.1:clean (default-clean) @ phyloutils ---
mojoSucceeded org.apache.maven.plugins:maven-clean-plugin:2.4.1(default-clean)
mojoStarted org.codehaus.mojo:cobertura-maven-plugin:2.5.1(clean)
[INFO] 
[INFO] --- cobertura-maven-plugin:2.5.1:clean (clean) @ phyloutils ---
mojoSucceeded org.codehaus.mojo:cobertura-maven-plugin:2.5.1(clean)
Dec 2, 2012 12:21:54 AM hudson.maven.ExecutedMojo <init>
WARNING: Failed to getClass for org.apache.maven.plugin.source.SourceJarMojo
mojoStarted org.apache.maven.plugins:maven-source-plugin:2.2.1(default-cli)
[INFO] 
[INFO] --- maven-source-plugin:2.2.1:jar (default-cli) @ phyloutils ---
[INFO] Building jar: /media/ephemeral0/workspace/phyloutils/target/phyloutils-0.93-SNAPSHOT-sources.jar
mojoSucceeded org.apache.maven.plugins:maven-source-plugin:2.2.1(default-cli)
mojoStarted org.apache.maven.plugins:maven-resources-plugin:2.5(default-resources)
[INFO] 
[INFO] --- maven-resources-plugin:2.5:resources (default-resources) @ phyloutils ---
[debug] execute contextualize
[INFO] Using 'UTF-8' encoding to copy filtered resources.
[INFO] Copying 7 resources
mojoSucceeded org.apache.maven.plugins:maven-resources-plugin:2.5(default-resources)
mojoStarted org.apache.maven.plugins:maven-compiler-plugin:2.4(default-compile)
[INFO] 
[INFO] --- maven-compiler-plugin:2.4:compile (default-compile) @ phyloutils ---
[INFO] Compiling 35 source files to /media/ephemeral0/workspace/phyloutils/target/classes
[INFO] -------------------------------------------------------------
[ERROR] COMPILATION ERROR : 
[INFO] -------------------------------------------------------------
[ERROR] Failure executing javac, but could not parse the error:
javac: invalid target release: 1.7
Usage: javac <options> <source files>
use -help for a list of possible options

[INFO] 1 error
[INFO] -------------------------------------------------------------
mojoFailed org.apache.maven.plugins:maven-compiler-plugin:2.4(default-compile)
projectFailed edu.berkeley.compbio:phyloutils:0.93-SNAPSHOT
sessionEnded
[INFO] ------------------------------------------------------------------------
[INFO] BUILD FAILURE
[INFO] ------------------------------------------------------------------------
[INFO] Total time: 1:19.148s
[INFO] Finished at: Sun Dec 02 00:22:05 UTC 2012
[INFO] Final Memory: 10M/25M
[INFO] ------------------------------------------------------------------------
Projects to build: [MavenProject: edu.berkeley.compbio:phyloutils:0.93-SNAPSHOT @ /media/ephemeral0/workspace/phyloutils/pom.xml]
[JENKINS] Archiving /media/ephemeral0/workspace/phyloutils/pom.xml to /usr/share/apache-tomcat-7.0.22/.jenkins/jobs/phyloutils/modules/edu.berkeley.compbio$phyloutils/builds/2012-12-01_19-20-01/archive/edu.berkeley.compbio/phyloutils/0.93-SNAPSHOT/phyloutils-0.93-SNAPSHOT.pom
[JENKINS] Archiving /media/ephemeral0/workspace/phyloutils/target/phyloutils-0.93-SNAPSHOT-sources.jar to /usr/share/apache-tomcat-7.0.22/.jenkins/jobs/phyloutils/modules/edu.berkeley.compbio$phyloutils/builds/2012-12-01_19-20-01/archive/edu.berkeley.compbio/phyloutils/0.93-SNAPSHOT/phyloutils-0.93-SNAPSHOT-sources.jar
Waiting for Jenkins to finish collecting data
mavenExecutionResult exceptions not empty
message : Failed to execute goal org.apache.maven.plugins:maven-compiler-plugin:2.4:compile (default-compile) on project phyloutils: Compilation failure
Failure executing javac, but could not parse the error:
javac: invalid target release: 1.7
Usage: javac <options> <source files>
use -help for a list of possible options


cause : Compilation failure
Failure executing javac, but could not parse the error:
javac: invalid target release: 1.7
Usage: javac <options> <source files>
use -help for a list of possible options


Stack trace : 
org.apache.maven.lifecycle.LifecycleExecutionException: Failed to execute goal org.apache.maven.plugins:maven-compiler-plugin:2.4:compile (default-compile) on project phyloutils: Compilation failure
Failure executing javac, but could not parse the error:
javac: invalid target release: 1.7
Usage: javac <options> <source files>
use -help for a list of possible options


	at org.apache.maven.lifecycle.internal.MojoExecutor.execute(MojoExecutor.java:213)
	at org.apache.maven.lifecycle.internal.MojoExecutor.execute(MojoExecutor.java:153)
	at org.apache.maven.lifecycle.internal.MojoExecutor.execute(MojoExecutor.java:145)
	at org.apache.maven.lifecycle.internal.LifecycleModuleBuilder.buildProject(LifecycleModuleBuilder.java:84)
	at org.apache.maven.lifecycle.internal.LifecycleModuleBuilder.buildProject(LifecycleModuleBuilder.java:59)
	at org.apache.maven.lifecycle.internal.LifecycleStarter.singleThreadedBuild(LifecycleStarter.java:183)
	at org.apache.maven.lifecycle.internal.LifecycleStarter.execute(LifecycleStarter.java:161)
	at org.apache.maven.DefaultMaven.doExecute(DefaultMaven.java:320)
	at org.apache.maven.DefaultMaven.execute(DefaultMaven.java:156)
	at org.jvnet.hudson.maven3.launcher.Maven3Launcher.main(Maven3Launcher.java:79)
	at sun.reflect.NativeMethodAccessorImpl.invoke0(Native Method)
	at sun.reflect.NativeMethodAccessorImpl.invoke(NativeMethodAccessorImpl.java:39)
	at sun.reflect.DelegatingMethodAccessorImpl.invoke(DelegatingMethodAccessorImpl.java:25)
	at java.lang.reflect.Method.invoke(Method.java:597)
	at org.codehaus.plexus.classworlds.launcher.Launcher.launchStandard(Launcher.java:329)
	at org.codehaus.plexus.classworlds.launcher.Launcher.launch(Launcher.java:239)
	at org.jvnet.hudson.maven3.agent.Maven3Main.launch(Maven3Main.java:158)
	at hudson.maven.Maven3Builder.call(Maven3Builder.java:98)
	at hudson.maven.Maven3Builder.call(Maven3Builder.java:64)
	at hudson.remoting.UserRequest.perform(UserRequest.java:118)
	at hudson.remoting.UserRequest.perform(UserRequest.java:48)
	at hudson.remoting.Request$2.run(Request.java:326)
	at hudson.remoting.InterceptingExecutorService$1.call(InterceptingExecutorService.java:72)
	at java.util.concurrent.FutureTask$Sync.innerRun(FutureTask.java:303)
	at java.util.concurrent.FutureTask.run(FutureTask.java:138)
	at java.util.concurrent.ThreadPoolExecutor$Worker.runTask(ThreadPoolExecutor.java:886)
	at java.util.concurrent.ThreadPoolExecutor$Worker.run(ThreadPoolExecutor.java:908)
	at java.lang.Thread.run(Thread.java:662)
Caused by: org.apache.maven.plugin.CompilationFailureException: Compilation failure
Failure executing javac, but could not parse the error:
javac: invalid target release: 1.7
Usage: javac <options> <source files>
use -help for a list of possible options


	at org.apache.maven.plugin.AbstractCompilerMojo.execute(AbstractCompilerMojo.java:678)
	at org.apache.maven.plugin.CompilerMojo.execute(CompilerMojo.java:128)
	at org.apache.maven.plugin.DefaultBuildPluginManager.executeMojo(DefaultBuildPluginManager.java:101)
	at org.apache.maven.lifecycle.internal.MojoExecutor.execute(MojoExecutor.java:209)
	... 27 more
channel stopped
Sending e-mails to: dev@davidsoergel.com
Finished: FAILURE