FailedConsole Output

Started by GitHub push by davidsoergel
Building in workspace /usr/share/apache-tomcat-7.0.22/.jenkins/jobs/ncbitaxonomy/workspace
Cloning the remote Git repository
Cloning repository https://github.com/davidsoergel/ncbitaxonomy.git
 > git init /usr/share/apache-tomcat-7.0.22/.jenkins/jobs/ncbitaxonomy/workspace
Fetching upstream changes from https://github.com/davidsoergel/ncbitaxonomy.git
 > git --version
 > git fetch --tags --progress https://github.com/davidsoergel/ncbitaxonomy.git +refs/heads/*:refs/remotes/origin/*
 > git config remote.origin.url https://github.com/davidsoergel/ncbitaxonomy.git
 > git config remote.origin.fetch +refs/heads/*:refs/remotes/origin/*
 > git config remote.origin.url https://github.com/davidsoergel/ncbitaxonomy.git
Fetching upstream changes from https://github.com/davidsoergel/ncbitaxonomy.git
 > git fetch --tags --progress https://github.com/davidsoergel/ncbitaxonomy.git +refs/heads/*:refs/remotes/origin/*
 > git rev-parse origin/master^{commit}
Checking out Revision 91ed49aab87a347366c1faac2d066eebfa93f16e (origin/master)
 > git config core.sparsecheckout
 > git checkout -f 91ed49aab87a347366c1faac2d066eebfa93f16e
First time build. Skipping changelog.
Parsing POMs
[workspace] $ java -Xmx1024M -XX:MaxPermSize=256M -cp /usr/share/apache-tomcat-7.0.22/.jenkins/plugins/maven-plugin/WEB-INF/lib/maven31-agent-1.5.jar:/usr/share/apache-tomcat-7.0.22/.jenkins/tools/hudson.tasks.Maven_MavenInstallation/Maven_3.1.1/boot/plexus-classworlds-2.5.1.jar:/usr/share/apache-tomcat-7.0.22/.jenkins/tools/hudson.tasks.Maven_MavenInstallation/Maven_3.1.1/conf/logging jenkins.maven3.agent.Maven31Main /usr/share/apache-tomcat-7.0.22/.jenkins/tools/hudson.tasks.Maven_MavenInstallation/Maven_3.1.1 /usr/share/apache-tomcat-7.0.22/webapps/jenkins/WEB-INF/lib/remoting-2.43.jar /usr/share/apache-tomcat-7.0.22/.jenkins/plugins/maven-plugin/WEB-INF/lib/maven31-interceptor-1.5.jar /usr/share/apache-tomcat-7.0.22/.jenkins/plugins/maven-plugin/WEB-INF/lib/maven3-interceptor-commons-1.5.jar 55057
<===[JENKINS REMOTING CAPACITY]===>channel started
Executing Maven:  -B -f /usr/share/apache-tomcat-7.0.22/.jenkins/jobs/ncbitaxonomy/workspace/pom.xml -U -e clean source:jar package jar:test-jar javadoc:jar
[INFO] Error stacktraces are turned on.
[WARNING] 
[WARNING] Some problems were encountered while building the effective settings
[WARNING] Unrecognised tag: 'scmVersionType' (position: START_TAG seen ...</username>\n    <scmVersionType>... @22:21)  @ /usr/share/apache-tomcat-7.0.22/.m2/settings.xml, line 22, column 21
[WARNING] 
[INFO] Scanning for projects...
[INFO] ------------------------------------------------------------------------
[INFO] Reactor Build Order:
[INFO] 
[INFO] ncbitaxonomy
[INFO] ncbitaxonomyClient
[INFO] ncbitaxonomyServer
[INFO] Downloading: http://dev.davidsoergel.com/nexus/content/groups/public/org/codehaus/mojo/maven-metadata.xml
[INFO] Downloading: http://repo.maven.apache.org/maven2/org/apache/maven/plugins/maven-metadata.xml
[INFO] Downloading: http://repo.maven.apache.org/maven2/org/codehaus/mojo/maven-metadata.xml
[INFO] Downloading: http://dev.davidsoergel.com/nexus/content/groups/public/org/apache/maven/plugins/maven-metadata.xml
[INFO] Downloaded: http://repo.maven.apache.org/maven2/org/apache/maven/plugins/maven-metadata.xml (13 KB at 26.9 KB/sec)
[INFO] Downloaded: http://dev.davidsoergel.com/nexus/content/groups/public/org/codehaus/mojo/maven-metadata.xml (20 KB at 36.4 KB/sec)
[INFO] Downloaded: http://dev.davidsoergel.com/nexus/content/groups/public/org/apache/maven/plugins/maven-metadata.xml (13 KB at 7.7 KB/sec)
[INFO] Downloaded: http://repo.maven.apache.org/maven2/org/codehaus/mojo/maven-metadata.xml (20 KB at 9.8 KB/sec)
[INFO] Downloading: http://dev.davidsoergel.com/nexus/content/groups/public/org/apache/maven/plugins/maven-source-plugin/maven-metadata.xml
[INFO] Downloading: http://repo.maven.apache.org/maven2/org/apache/maven/plugins/maven-source-plugin/maven-metadata.xml
[INFO] Downloaded: http://repo.maven.apache.org/maven2/org/apache/maven/plugins/maven-source-plugin/maven-metadata.xml (692 B at 18.8 KB/sec)
[INFO] Downloaded: http://dev.davidsoergel.com/nexus/content/groups/public/org/apache/maven/plugins/maven-source-plugin/maven-metadata.xml (692 B at 0.6 KB/sec)
[INFO] Downloading: http://repo.maven.apache.org/maven2/org/apache/maven/plugins/maven-javadoc-plugin/maven-metadata.xml
[INFO] Downloading: http://dev.davidsoergel.com/nexus/content/groups/public/org/apache/maven/plugins/maven-javadoc-plugin/maven-metadata.xml
[INFO] Downloaded: http://dev.davidsoergel.com/nexus/content/groups/public/org/apache/maven/plugins/maven-javadoc-plugin/maven-metadata.xml (782 B at 8.7 KB/sec)
[INFO] Downloaded: http://repo.maven.apache.org/maven2/org/apache/maven/plugins/maven-javadoc-plugin/maven-metadata.xml (782 B at 7.1 KB/sec)
[INFO]                                                                         
[INFO] ------------------------------------------------------------------------
[INFO] Building ncbitaxonomy 0.91-SNAPSHOT
[INFO] ------------------------------------------------------------------------
[INFO] 
[INFO] --- maven-clean-plugin:2.5:clean (default-clean) @ ncbitaxonomy ---
[INFO] 
[INFO] --- cobertura-maven-plugin:2.5.1:clean (clean) @ ncbitaxonomy ---
[INFO] Skipping cobertura mojo for project with packaging type 'pom'
[INFO] 
[INFO] >>> maven-source-plugin:2.2.1:jar (default-cli) @ ncbitaxonomy >>>
[WARNING] Failed to getClass for org.apache.maven.plugin.source.SourceJarMojo
[INFO] 
[INFO] <<< maven-source-plugin:2.2.1:jar (default-cli) @ ncbitaxonomy <<<
[INFO] 
[INFO] --- maven-source-plugin:2.2.1:jar (default-cli) @ ncbitaxonomy ---
[INFO] 
[INFO] --- maven-jar-plugin:2.4:test-jar (default) @ ncbitaxonomy ---
[WARNING] JAR will be empty - no content was marked for inclusion!
[INFO] Building jar: /usr/share/apache-tomcat-7.0.22/.jenkins/jobs/ncbitaxonomy/workspace/target/ncbitaxonomy-0.91-SNAPSHOT-tests.jar
[INFO] 
[INFO] --- maven-jar-plugin:2.4:jar (default) @ ncbitaxonomy ---
[WARNING] JAR will be empty - no content was marked for inclusion!
[INFO] Building jar: /usr/share/apache-tomcat-7.0.22/.jenkins/jobs/ncbitaxonomy/workspace/target/ncbitaxonomy-0.91-SNAPSHOT.jar
[INFO] 
[INFO] --- maven-jar-plugin:2.4:test-jar (default-cli) @ ncbitaxonomy ---
[WARNING] JAR will be empty - no content was marked for inclusion!
[INFO] 
[INFO] --- maven-javadoc-plugin:2.9.1:jar (default-cli) @ ncbitaxonomy ---
[INFO] Not executing Javadoc as the project is not a Java classpath-capable package
[INFO]                                                                         
[INFO] ------------------------------------------------------------------------
[INFO] Building ncbitaxonomyClient 0.91-SNAPSHOT
[INFO] ------------------------------------------------------------------------
[INFO] Downloading: http://dev.davidsoergel.com/nexus/content/groups/public/com/caucho/hessian/3.1.3/hessian-3.1.3.pom
[INFO] Downloaded: http://dev.davidsoergel.com/nexus/content/groups/public/com/caucho/hessian/3.1.3/hessian-3.1.3.pom (623 B at 3.5 KB/sec)
[INFO] Downloading: http://repo.maven.apache.org/maven2/com/caucho/hessian/3.1.3/hessian-3.1.3.pom
[INFO] Downloaded: http://repo.maven.apache.org/maven2/com/caucho/hessian/3.1.3/hessian-3.1.3.pom (623 B at 9.4 KB/sec)
[INFO] Downloading: http://dev.davidsoergel.com/nexus/content/groups/public/edu/berkeley/compbio/phyloutils/0.921/phyloutils-0.921.pom
[INFO] Downloaded: http://dev.davidsoergel.com/nexus/content/groups/public/edu/berkeley/compbio/phyloutils/0.921/phyloutils-0.921.pom (7 KB at 42.9 KB/sec)
[INFO] Downloading: http://repo.maven.apache.org/maven2/edu/berkeley/compbio/phyloutils/0.921/phyloutils-0.921.pom
[INFO] Downloading: http://dev.davidsoergel.com/nexus/content/groups/public/com/davidsoergel/conja/1.051/conja-1.051.pom
[INFO] Downloaded: http://dev.davidsoergel.com/nexus/content/groups/public/com/davidsoergel/conja/1.051/conja-1.051.pom (4 KB at 23.0 KB/sec)
[INFO] Downloading: http://repo.maven.apache.org/maven2/com/davidsoergel/conja/1.051/conja-1.051.pom
[INFO] Downloading: http://dev.davidsoergel.com/nexus/content/groups/public/com/davidsoergel/basepom/0.95/basepom-0.95.pom
[INFO] Downloaded: http://dev.davidsoergel.com/nexus/content/groups/public/com/davidsoergel/basepom/0.95/basepom-0.95.pom (9 KB at 65.1 KB/sec)
[INFO] Downloading: http://repo.maven.apache.org/maven2/com/davidsoergel/basepom/0.95/basepom-0.95.pom
[INFO] Downloading: http://dev.davidsoergel.com/nexus/content/groups/public/log4j/log4j/1.2.13/log4j-1.2.13.pom
[INFO] Downloaded: http://dev.davidsoergel.com/nexus/content/groups/public/log4j/log4j/1.2.13/log4j-1.2.13.pom (389 B at 1.9 KB/sec)
[INFO] Downloading: http://repo.maven.apache.org/maven2/log4j/log4j/1.2.13/log4j-1.2.13.pom
[INFO] Downloaded: http://repo.maven.apache.org/maven2/log4j/log4j/1.2.13/log4j-1.2.13.pom (389 B at 7.6 KB/sec)
[INFO] Downloading: http://dev.davidsoergel.com/nexus/content/groups/public/org/springframework/spring-core/3.2.2.RELEASE/spring-core-3.2.2.RELEASE.pom
[INFO] Downloaded: http://dev.davidsoergel.com/nexus/content/groups/public/org/springframework/spring-core/3.2.2.RELEASE/spring-core-3.2.2.RELEASE.pom (3 KB at 16.6 KB/sec)
[INFO] Downloading: http://repo.maven.apache.org/maven2/org/springframework/spring-core/3.2.2.RELEASE/spring-core-3.2.2.RELEASE.pom
[INFO] Downloaded: http://repo.maven.apache.org/maven2/org/springframework/spring-core/3.2.2.RELEASE/spring-core-3.2.2.RELEASE.pom (3 KB at 58.3 KB/sec)
[INFO] Downloading: http://dev.davidsoergel.com/nexus/content/groups/public/edu/berkeley/compbio/phyloutils/0.921/phyloutils-0.921.jar
[INFO] Downloading: http://dev.davidsoergel.com/nexus/content/groups/public/com/davidsoergel/conja/1.051/conja-1.051.jar
[INFO] Downloading: http://dev.davidsoergel.com/nexus/content/groups/public/com/caucho/hessian/3.1.3/hessian-3.1.3.jar
[INFO] Downloading: http://dev.davidsoergel.com/nexus/content/groups/public/org/springframework/spring-core/3.2.2.RELEASE/spring-core-3.2.2.RELEASE.jar
[INFO] Downloaded: http://dev.davidsoergel.com/nexus/content/groups/public/com/caucho/hessian/3.1.3/hessian-3.1.3.jar (267 KB at 2083.4 KB/sec)
[INFO] Downloaded: http://dev.davidsoergel.com/nexus/content/groups/public/org/springframework/spring-core/3.2.2.RELEASE/spring-core-3.2.2.RELEASE.jar (847 KB at 2074.7 KB/sec)
[INFO] Downloaded: http://dev.davidsoergel.com/nexus/content/groups/public/com/davidsoergel/conja/1.051/conja-1.051.jar (30 KB at 71.9 KB/sec)
[INFO] Downloaded: http://dev.davidsoergel.com/nexus/content/groups/public/edu/berkeley/compbio/phyloutils/0.921/phyloutils-0.921.jar (2793 KB at 4547.4 KB/sec)
[INFO] Downloading: http://repo.maven.apache.org/maven2/edu/berkeley/compbio/phyloutils/0.921/phyloutils-0.921.jar
[INFO] Downloading: http://repo.maven.apache.org/maven2/com/davidsoergel/conja/1.051/conja-1.051.jar
[INFO] Downloading: http://repo.maven.apache.org/maven2/com/caucho/hessian/3.1.3/hessian-3.1.3.jar
[INFO] Downloading: http://repo.maven.apache.org/maven2/org/springframework/spring-core/3.2.2.RELEASE/spring-core-3.2.2.RELEASE.jar
[INFO] Downloaded: http://repo.maven.apache.org/maven2/org/springframework/spring-core/3.2.2.RELEASE/spring-core-3.2.2.RELEASE.jar (847 KB at 3992.8 KB/sec)
[INFO] Downloaded: http://repo.maven.apache.org/maven2/com/caucho/hessian/3.1.3/hessian-3.1.3.jar (267 KB at 800.8 KB/sec)
[INFO] 
[INFO] --- maven-clean-plugin:2.5:clean (default-clean) @ ncbitaxonomyClient ---
[INFO] 
[INFO] --- cobertura-maven-plugin:2.5.1:clean (clean) @ ncbitaxonomyClient ---
[INFO] 
[INFO] >>> maven-source-plugin:2.2.1:jar (default-cli) @ ncbitaxonomyClient >>>
[WARNING] Failed to getClass for org.apache.maven.plugin.source.SourceJarMojo
[INFO] 
[INFO] <<< maven-source-plugin:2.2.1:jar (default-cli) @ ncbitaxonomyClient <<<
[INFO] 
[INFO] --- maven-source-plugin:2.2.1:jar (default-cli) @ ncbitaxonomyClient ---
[INFO] Building jar: /usr/share/apache-tomcat-7.0.22/.jenkins/jobs/ncbitaxonomy/workspace/ncbitaxonomyClient/target/ncbitaxonomyClient-0.91-SNAPSHOT-sources.jar
[INFO] 
[INFO] --- maven-resources-plugin:2.6:resources (default-resources) @ ncbitaxonomyClient ---
[INFO] Using 'UTF-8' encoding to copy filtered resources.
[INFO] Copying 1 resource
[INFO] 
[INFO] --- maven-compiler-plugin:2.4:compile (default-compile) @ ncbitaxonomyClient ---
[INFO] Compiling 10 source files to /usr/share/apache-tomcat-7.0.22/.jenkins/jobs/ncbitaxonomy/workspace/ncbitaxonomyClient/target/classes
[INFO] -------------------------------------------------------------
[ERROR] COMPILATION ERROR : 
[INFO] -------------------------------------------------------------
[ERROR] /usr/share/apache-tomcat-7.0.22/.jenkins/jobs/ncbitaxonomy/workspace/ncbitaxonomyClient/src/main/java/edu/berkeley/compbio/ncbitaxonomy/service/NcbiTaxonomyClient.java:[22,34] package org.springframework.context does not exist
[ERROR] /usr/share/apache-tomcat-7.0.22/.jenkins/jobs/ncbitaxonomy/workspace/ncbitaxonomyClient/src/main/java/edu/berkeley/compbio/ncbitaxonomy/service/NcbiCiccarelliHybridClient.java:[18,34] package org.springframework.context does not exist
[ERROR] /usr/share/apache-tomcat-7.0.22/.jenkins/jobs/ncbitaxonomy/workspace/ncbitaxonomyClient/src/main/java/edu/berkeley/compbio/ncbitaxonomy/service/NcbiTaxonomyWithUnitBranchLengthsClient.java:[17,34] package org.springframework.context does not exist
[ERROR] /usr/share/apache-tomcat-7.0.22/.jenkins/jobs/ncbitaxonomy/workspace/ncbitaxonomyClient/src/main/java/edu/berkeley/compbio/ncbitaxonomy/service/NcbiTaxonomyServicesContextFactory.java:[13,47] package org.springframework.beans.factory.config does not exist
[ERROR] /usr/share/apache-tomcat-7.0.22/.jenkins/jobs/ncbitaxonomy/workspace/ncbitaxonomyClient/src/main/java/edu/berkeley/compbio/ncbitaxonomy/service/NcbiTaxonomyServicesContextFactory.java:[14,44] package org.springframework.beans.factory.xml does not exist
[ERROR] /usr/share/apache-tomcat-7.0.22/.jenkins/jobs/ncbitaxonomy/workspace/ncbitaxonomyClient/src/main/java/edu/berkeley/compbio/ncbitaxonomy/service/NcbiTaxonomyServicesContextFactory.java:[15,34] package org.springframework.context does not exist
[ERROR] /usr/share/apache-tomcat-7.0.22/.jenkins/jobs/ncbitaxonomy/workspace/ncbitaxonomyClient/src/main/java/edu/berkeley/compbio/ncbitaxonomy/service/NcbiTaxonomyServicesContextFactory.java:[16,42] package org.springframework.context.support does not exist
[ERROR] /usr/share/apache-tomcat-7.0.22/.jenkins/jobs/ncbitaxonomy/workspace/ncbitaxonomyClient/src/main/java/edu/berkeley/compbio/ncbitaxonomy/service/NcbiTaxonomyServicesContextFactory.java:[33,15] cannot find symbol
symbol  : class ApplicationContext
location: class edu.berkeley.compbio.ncbitaxonomy.service.NcbiTaxonomyServicesContextFactory
[ERROR] /usr/share/apache-tomcat-7.0.22/.jenkins/jobs/ncbitaxonomy/workspace/ncbitaxonomyClient/src/main/java/edu/berkeley/compbio/ncbitaxonomy/service/NcbiTaxonomyClient.java:[128,2] cannot find symbol
symbol  : class ApplicationContext
location: class edu.berkeley.compbio.ncbitaxonomy.service.NcbiTaxonomyClient
[ERROR] /usr/share/apache-tomcat-7.0.22/.jenkins/jobs/ncbitaxonomy/workspace/ncbitaxonomyClient/src/main/java/edu/berkeley/compbio/ncbitaxonomy/service/NcbiCiccarelliHybridClient.java:[60,2] cannot find symbol
symbol  : class ApplicationContext
location: class edu.berkeley.compbio.ncbitaxonomy.service.NcbiCiccarelliHybridClient
[ERROR] /usr/share/apache-tomcat-7.0.22/.jenkins/jobs/ncbitaxonomy/workspace/ncbitaxonomyClient/src/main/java/edu/berkeley/compbio/ncbitaxonomy/service/NcbiTaxonomyWithUnitBranchLengthsClient.java:[79,2] cannot find symbol
symbol  : class ApplicationContext
location: class edu.berkeley.compbio.ncbitaxonomy.service.NcbiTaxonomyWithUnitBranchLengthsClient
[ERROR] /usr/share/apache-tomcat-7.0.22/.jenkins/jobs/ncbitaxonomy/workspace/ncbitaxonomyClient/src/main/java/edu/berkeley/compbio/ncbitaxonomy/service/NcbiTaxonomyServicesContextFactory.java:[56,2] cannot find symbol
symbol  : class GenericApplicationContext
location: class edu.berkeley.compbio.ncbitaxonomy.service.NcbiTaxonomyServicesContextFactory
[ERROR] /usr/share/apache-tomcat-7.0.22/.jenkins/jobs/ncbitaxonomy/workspace/ncbitaxonomyClient/src/main/java/edu/berkeley/compbio/ncbitaxonomy/service/NcbiTaxonomyServicesContextFactory.java:[56,38] cannot find symbol
symbol  : class GenericApplicationContext
location: class edu.berkeley.compbio.ncbitaxonomy.service.NcbiTaxonomyServicesContextFactory
[ERROR] /usr/share/apache-tomcat-7.0.22/.jenkins/jobs/ncbitaxonomy/workspace/ncbitaxonomyClient/src/main/java/edu/berkeley/compbio/ncbitaxonomy/service/NcbiTaxonomyServicesContextFactory.java:[57,2] cannot find symbol
symbol  : class XmlBeanDefinitionReader
location: class edu.berkeley.compbio.ncbitaxonomy.service.NcbiTaxonomyServicesContextFactory
[ERROR] /usr/share/apache-tomcat-7.0.22/.jenkins/jobs/ncbitaxonomy/workspace/ncbitaxonomyClient/src/main/java/edu/berkeley/compbio/ncbitaxonomy/service/NcbiTaxonomyServicesContextFactory.java:[57,42] cannot find symbol
symbol  : class XmlBeanDefinitionReader
location: class edu.berkeley.compbio.ncbitaxonomy.service.NcbiTaxonomyServicesContextFactory
[ERROR] /usr/share/apache-tomcat-7.0.22/.jenkins/jobs/ncbitaxonomy/workspace/ncbitaxonomyClient/src/main/java/edu/berkeley/compbio/ncbitaxonomy/service/NcbiTaxonomyServicesContextFactory.java:[60,2] cannot find symbol
symbol  : class PropertyPlaceholderConfigurer
location: class edu.berkeley.compbio.ncbitaxonomy.service.NcbiTaxonomyServicesContextFactory
[ERROR] /usr/share/apache-tomcat-7.0.22/.jenkins/jobs/ncbitaxonomy/workspace/ncbitaxonomyClient/src/main/java/edu/berkeley/compbio/ncbitaxonomy/service/NcbiTaxonomyServicesContextFactory.java:[60,42] cannot find symbol
symbol  : class PropertyPlaceholderConfigurer
location: class edu.berkeley.compbio.ncbitaxonomy.service.NcbiTaxonomyServicesContextFactory
[INFO] 17 errors 
[INFO] -------------------------------------------------------------
[INFO] ------------------------------------------------------------------------
[INFO] Reactor Summary:
[INFO] 
[INFO] ncbitaxonomy ...................................... SUCCESS [5.647s]
[INFO] ncbitaxonomyClient ................................ FAILURE [6.120s]
[INFO] ncbitaxonomyServer ................................ SKIPPED
[INFO] ------------------------------------------------------------------------
[INFO] BUILD FAILURE
[INFO] ------------------------------------------------------------------------
[INFO] Total time: 19.388s
[INFO] Finished at: Sun Jul 06 17:57:42 EDT 2014
[INFO] Final Memory: 16M/42M
[INFO] ------------------------------------------------------------------------
[ERROR] Failed to execute goal org.apache.maven.plugins:maven-compiler-plugin:2.4:compile (default-compile) on project ncbitaxonomyClient: Compilation failure: Compilation failure:
[ERROR] /usr/share/apache-tomcat-7.0.22/.jenkins/jobs/ncbitaxonomy/workspace/ncbitaxonomyClient/src/main/java/edu/berkeley/compbio/ncbitaxonomy/service/NcbiTaxonomyClient.java:[22,34] package org.springframework.context does not exist
[ERROR] /usr/share/apache-tomcat-7.0.22/.jenkins/jobs/ncbitaxonomy/workspace/ncbitaxonomyClient/src/main/java/edu/berkeley/compbio/ncbitaxonomy/service/NcbiCiccarelliHybridClient.java:[18,34] package org.springframework.context does not exist
[ERROR] /usr/share/apache-tomcat-7.0.22/.jenkins/jobs/ncbitaxonomy/workspace/ncbitaxonomyClient/src/main/java/edu/berkeley/compbio/ncbitaxonomy/service/NcbiTaxonomyWithUnitBranchLengthsClient.java:[17,34] package org.springframework.context does not exist
[ERROR] /usr/share/apache-tomcat-7.0.22/.jenkins/jobs/ncbitaxonomy/workspace/ncbitaxonomyClient/src/main/java/edu/berkeley/compbio/ncbitaxonomy/service/NcbiTaxonomyServicesContextFactory.java:[13,47] package org.springframework.beans.factory.config does not exist
[ERROR] /usr/share/apache-tomcat-7.0.22/.jenkins/jobs/ncbitaxonomy/workspace/ncbitaxonomyClient/src/main/java/edu/berkeley/compbio/ncbitaxonomy/service/NcbiTaxonomyServicesContextFactory.java:[14,44] package org.springframework.beans.factory.xml does not exist
[ERROR] /usr/share/apache-tomcat-7.0.22/.jenkins/jobs/ncbitaxonomy/workspace/ncbitaxonomyClient/src/main/java/edu/berkeley/compbio/ncbitaxonomy/service/NcbiTaxonomyServicesContextFactory.java:[15,34] package org.springframework.context does not exist
[ERROR] /usr/share/apache-tomcat-7.0.22/.jenkins/jobs/ncbitaxonomy/workspace/ncbitaxonomyClient/src/main/java/edu/berkeley/compbio/ncbitaxonomy/service/NcbiTaxonomyServicesContextFactory.java:[16,42] package org.springframework.context.support does not exist
[ERROR] /usr/share/apache-tomcat-7.0.22/.jenkins/jobs/ncbitaxonomy/workspace/ncbitaxonomyClient/src/main/java/edu/berkeley/compbio/ncbitaxonomy/service/NcbiTaxonomyServicesContextFactory.java:[33,15] cannot find symbol
[ERROR] symbol  : class ApplicationContext
[ERROR] location: class edu.berkeley.compbio.ncbitaxonomy.service.NcbiTaxonomyServicesContextFactory
[ERROR] /usr/share/apache-tomcat-7.0.22/.jenkins/jobs/ncbitaxonomy/workspace/ncbitaxonomyClient/src/main/java/edu/berkeley/compbio/ncbitaxonomy/service/NcbiTaxonomyClient.java:[128,2] cannot find symbol
[ERROR] symbol  : class ApplicationContext
[ERROR] location: class edu.berkeley.compbio.ncbitaxonomy.service.NcbiTaxonomyClient
[ERROR] /usr/share/apache-tomcat-7.0.22/.jenkins/jobs/ncbitaxonomy/workspace/ncbitaxonomyClient/src/main/java/edu/berkeley/compbio/ncbitaxonomy/service/NcbiCiccarelliHybridClient.java:[60,2] cannot find symbol
[ERROR] symbol  : class ApplicationContext
[ERROR] location: class edu.berkeley.compbio.ncbitaxonomy.service.NcbiCiccarelliHybridClient
[ERROR] /usr/share/apache-tomcat-7.0.22/.jenkins/jobs/ncbitaxonomy/workspace/ncbitaxonomyClient/src/main/java/edu/berkeley/compbio/ncbitaxonomy/service/NcbiTaxonomyWithUnitBranchLengthsClient.java:[79,2] cannot find symbol
[ERROR] symbol  : class ApplicationContext
[ERROR] location: class edu.berkeley.compbio.ncbitaxonomy.service.NcbiTaxonomyWithUnitBranchLengthsClient
[ERROR] /usr/share/apache-tomcat-7.0.22/.jenkins/jobs/ncbitaxonomy/workspace/ncbitaxonomyClient/src/main/java/edu/berkeley/compbio/ncbitaxonomy/service/NcbiTaxonomyServicesContextFactory.java:[56,2] cannot find symbol
[ERROR] symbol  : class GenericApplicationContext
[ERROR] location: class edu.berkeley.compbio.ncbitaxonomy.service.NcbiTaxonomyServicesContextFactory
[ERROR] /usr/share/apache-tomcat-7.0.22/.jenkins/jobs/ncbitaxonomy/workspace/ncbitaxonomyClient/src/main/java/edu/berkeley/compbio/ncbitaxonomy/service/NcbiTaxonomyServicesContextFactory.java:[56,38] cannot find symbol
[ERROR] symbol  : class GenericApplicationContext
[ERROR] location: class edu.berkeley.compbio.ncbitaxonomy.service.NcbiTaxonomyServicesContextFactory
[ERROR] /usr/share/apache-tomcat-7.0.22/.jenkins/jobs/ncbitaxonomy/workspace/ncbitaxonomyClient/src/main/java/edu/berkeley/compbio/ncbitaxonomy/service/NcbiTaxonomyServicesContextFactory.java:[57,2] cannot find symbol
[ERROR] symbol  : class XmlBeanDefinitionReader
[ERROR] location: class edu.berkeley.compbio.ncbitaxonomy.service.NcbiTaxonomyServicesContextFactory
[ERROR] /usr/share/apache-tomcat-7.0.22/.jenkins/jobs/ncbitaxonomy/workspace/ncbitaxonomyClient/src/main/java/edu/berkeley/compbio/ncbitaxonomy/service/NcbiTaxonomyServicesContextFactory.java:[57,42] cannot find symbol
[ERROR] symbol  : class XmlBeanDefinitionReader
[ERROR] location: class edu.berkeley.compbio.ncbitaxonomy.service.NcbiTaxonomyServicesContextFactory
[JENKINS] Archiving /usr/share/apache-tomcat-7.0.22/.jenkins/jobs/ncbitaxonomy/workspace/target/ncbitaxonomy-0.91-SNAPSHOT.jar to edu.berkeley.compbio/ncbitaxonomy/0.91-SNAPSHOT/ncbitaxonomy-0.91-SNAPSHOT.pom
[JENKINS] Archiving /usr/share/apache-tomcat-7.0.22/.jenkins/jobs/ncbitaxonomy/workspace/target/ncbitaxonomy-0.91-SNAPSHOT-tests.jar to edu.berkeley.compbio/ncbitaxonomy/0.91-SNAPSHOT/ncbitaxonomy-0.91-SNAPSHOT-tests.jar
[JENKINS] Archiving /usr/share/apache-tomcat-7.0.22/.jenkins/jobs/ncbitaxonomy/workspace/ncbitaxonomyClient/pom.xml to edu.berkeley.compbio/ncbitaxonomyClient/0.91-SNAPSHOT/ncbitaxonomyClient-0.91-SNAPSHOT.pom
[JENKINS] Archiving /usr/share/apache-tomcat-7.0.22/.jenkins/jobs/ncbitaxonomy/workspace/ncbitaxonomyClient/target/ncbitaxonomyClient-0.91-SNAPSHOT-sources.jar to edu.berkeley.compbio/ncbitaxonomyClient/0.91-SNAPSHOT/ncbitaxonomyClient-0.91-SNAPSHOT-sources.jar
[JENKINS] Archiving /usr/share/apache-tomcat-7.0.22/.jenkins/jobs/ncbitaxonomy/workspace/ncbitaxonomyServer/pom.xml to edu.berkeley.compbio/ncbitaxonomyServer/0.91-SNAPSHOT/ncbitaxonomyServer-0.91-SNAPSHOT.pom
[ERROR] /usr/share/apache-tomcat-7.0.22/.jenkins/jobs/ncbitaxonomy/workspace/ncbitaxonomyClient/src/main/java/edu/berkeley/compbio/ncbitaxonomy/service/NcbiTaxonomyServicesContextFactory.java:[60,2] cannot find symbol
[ERROR] symbol  : class PropertyPlaceholderConfigurer
[ERROR] location: class edu.berkeley.compbio.ncbitaxonomy.service.NcbiTaxonomyServicesContextFactory
[ERROR] /usr/share/apache-tomcat-7.0.22/.jenkins/jobs/ncbitaxonomy/workspace/ncbitaxonomyClient/src/main/java/edu/berkeley/compbio/ncbitaxonomy/service/NcbiTaxonomyServicesContextFactory.java:[60,42] cannot find symbol
[ERROR] symbol  : class PropertyPlaceholderConfigurer
[ERROR] location: class edu.berkeley.compbio.ncbitaxonomy.service.NcbiTaxonomyServicesContextFactory
[ERROR] -> [Help 1]
org.apache.maven.lifecycle.LifecycleExecutionException: Failed to execute goal org.apache.maven.plugins:maven-compiler-plugin:2.4:compile (default-compile) on project ncbitaxonomyClient: Compilation failure
	at org.apache.maven.lifecycle.internal.MojoExecutor.execute(MojoExecutor.java:212)
	at org.apache.maven.lifecycle.internal.MojoExecutor.execute(MojoExecutor.java:153)
	at org.apache.maven.lifecycle.internal.MojoExecutor.execute(MojoExecutor.java:145)
	at org.apache.maven.lifecycle.internal.LifecycleModuleBuilder.buildProject(LifecycleModuleBuilder.java:84)
	at org.apache.maven.lifecycle.internal.LifecycleModuleBuilder.buildProject(LifecycleModuleBuilder.java:59)
	at org.apache.maven.lifecycle.internal.LifecycleStarter.singleThreadedBuild(LifecycleStarter.java:183)
	at org.apache.maven.lifecycle.internal.LifecycleStarter.execute(LifecycleStarter.java:161)
	at org.apache.maven.DefaultMaven.doExecute(DefaultMaven.java:317)
	at org.apache.maven.DefaultMaven.execute(DefaultMaven.java:152)
	at org.jvnet.hudson.maven3.launcher.Maven31Launcher.main(Maven31Launcher.java:132)
	at sun.reflect.NativeMethodAccessorImpl.invoke0(Native Method)
	at sun.reflect.NativeMethodAccessorImpl.invoke(NativeMethodAccessorImpl.java:39)
	at sun.reflect.DelegatingMethodAccessorImpl.invoke(DelegatingMethodAccessorImpl.java:25)
	at java.lang.reflect.Method.invoke(Method.java:597)
	at org.codehaus.plexus.classworlds.launcher.Launcher.launchStandard(Launcher.java:330)
	at org.codehaus.plexus.classworlds.launcher.Launcher.launch(Launcher.java:238)
	at jenkins.maven3.agent.Maven31Main.launch(Maven31Main.java:181)
	at sun.reflect.NativeMethodAccessorImpl.invoke0(Native Method)
	at sun.reflect.NativeMethodAccessorImpl.invoke(NativeMethodAccessorImpl.java:39)
	at sun.reflect.DelegatingMethodAccessorImpl.invoke(DelegatingMethodAccessorImpl.java:25)
	at java.lang.reflect.Method.invoke(Method.java:597)
	at hudson.maven.Maven3Builder.call(Maven3Builder.java:134)
	at hudson.maven.Maven3Builder.call(Maven3Builder.java:69)
	at hudson.remoting.UserRequest.perform(UserRequest.java:118)
	at hudson.remoting.UserRequest.perform(UserRequest.java:48)
	at hudson.remoting.Request$2.run(Request.java:328)
	at hudson.remoting.InterceptingExecutorService$1.call(InterceptingExecutorService.java:72)
	at java.util.concurrent.FutureTask$Sync.innerRun(FutureTask.java:303)
	at java.util.concurrent.FutureTask.run(FutureTask.java:138)
	at java.util.concurrent.ThreadPoolExecutor$Worker.runTask(ThreadPoolExecutor.java:886)
	at java.util.concurrent.ThreadPoolExecutor$Worker.run(ThreadPoolExecutor.java:908)
	at java.lang.Thread.run(Thread.java:662)
Caused by: org.apache.maven.plugin.CompilationFailureException: Compilation failure
	at org.apache.maven.plugin.AbstractCompilerMojo.execute(AbstractCompilerMojo.java:678)
	at org.apache.maven.plugin.CompilerMojo.execute(CompilerMojo.java:128)
	at org.apache.maven.plugin.DefaultBuildPluginManager.executeMojo(DefaultBuildPluginManager.java:106)
	at org.apache.maven.lifecycle.internal.MojoExecutor.execute(MojoExecutor.java:208)
	... 31 more
[ERROR] 
[ERROR] Re-run Maven using the -X switch to enable full debug logging.
[ERROR] 
[ERROR] For more information about the errors and possible solutions, please read the following articles:
[ERROR] [Help 1] http://cwiki.apache.org/confluence/display/MAVEN/MojoFailureException
[ERROR] 
[ERROR] After correcting the problems, you can resume the build with the command
[ERROR]   mvn <goals> -rf :ncbitaxonomyClient
Sending e-mails to: dev@davidsoergel.com
channel stopped
Sending e-mails to: dev@davidsoergel.com
Warning: you have no plugins providing access control for builds, so falling back to legacy behavior of permitting any downstream builds to be triggered
Finished: FAILURE