FailedConsole Output

Started by user David Soergel
Building remotely on i-0404a965 in workspace /media/ephemeral0/workspace/ncbitaxonomy
$ hg clone --rev default --noupdate ssh://jenkins@dev.davidsoergel.com//home/hg/ncbitaxonomy /media/ephemeral0/workspace/ncbitaxonomy
adding changesets
adding manifests
adding file changes
added 279 changesets with 808 changes to 114 files
[ncbitaxonomy] $ hg update --rev default
61 files updated, 0 files merged, 0 files removed, 0 files unresolved
[ncbitaxonomy] $ hg log --rev . --template {node}
[ncbitaxonomy] $ hg log --rev . --template {rev}
[ncbitaxonomy] $ hg log --rev 8a643fe4834c2014fef5b8bf49ffeeaaaaa3fb47
[ncbitaxonomy] $ hg log --template "<changeset node='{node}' author='{author|xmlescape}' rev='{rev}' date='{date}'><msg>{desc|xmlescape}</msg><added>{file_adds|stringify|xmlescape}</added><deleted>{file_dels|stringify|xmlescape}</deleted><files>{files|stringify|xmlescape}</files><parents>{parents}</parents></changeset>\n" --rev default:0 --follow --prune 8a643fe4834c2014fef5b8bf49ffeeaaaaa3fb47
Parsing POMs
[ncbitaxonomy] $ java -Xmx1024M -XX:MaxPermSize=256M -cp /media/ephemeral0/maven3-agent.jar:/media/ephemeral0/tools/hudson.tasks.Maven_MavenInstallation/Maven_3.0.4/boot/plexus-classworlds-2.4.jar org.jvnet.hudson.maven3.agent.Maven3Main /media/ephemeral0/tools/hudson.tasks.Maven_MavenInstallation/Maven_3.0.4 /tmp/slave.jar /media/ephemeral0/maven3-interceptor.jar 35983
<===[JENKINS REMOTING CAPACITY]===>channel started
log4j:WARN No appenders could be found for logger (org.apache.commons.beanutils.converters.BooleanConverter).
log4j:WARN Please initialize the log4j system properly.
Executing Maven:  -B -f /media/ephemeral0/workspace/ncbitaxonomy/pom.xml -U -e clean source:jar package jar:test-jar
[INFO] Error stacktraces are turned on.
[INFO] Scanning for projects...
[INFO] ------------------------------------------------------------------------
[INFO] Reactor Build Order:
[INFO] 
[INFO] ncbitaxonomy
[INFO] ncbitaxonomyClient
[INFO] ncbitaxonomyServer
Downloading: http://dev.davidsoergel.com/nexus/content/groups/public/org/codehaus/mojo/maven-metadata.xml
Downloading: http://repo.maven.apache.org/maven2/org/codehaus/mojo/maven-metadata.xml
Downloading: http://repo.maven.apache.org/maven2/org/apache/maven/plugins/maven-metadata.xml
Downloading: http://dev.davidsoergel.com/nexus/content/groups/public/org/apache/maven/plugins/maven-metadata.xml
Downloaded: http://repo.maven.apache.org/maven2/org/codehaus/mojo/maven-metadata.xml (22 KB at 13.0 KB/sec)
Downloaded: http://repo.maven.apache.org/maven2/org/apache/maven/plugins/maven-metadata.xml (11 KB at 6.6 KB/sec)
Downloaded: http://dev.davidsoergel.com/nexus/content/groups/public/org/apache/maven/plugins/maven-metadata.xml (11 KB at 8.1 KB/sec)
Downloaded: http://dev.davidsoergel.com/nexus/content/groups/public/org/codehaus/mojo/maven-metadata.xml (22 KB at 12.1 KB/sec)
Downloading: http://repo.maven.apache.org/maven2/org/apache/maven/plugins/maven-source-plugin/maven-metadata.xml
Downloading: http://dev.davidsoergel.com/nexus/content/groups/public/org/apache/maven/plugins/maven-source-plugin/maven-metadata.xml
Downloaded: http://repo.maven.apache.org/maven2/org/apache/maven/plugins/maven-source-plugin/maven-metadata.xml (692 B at 4.9 KB/sec)
Downloaded: http://dev.davidsoergel.com/nexus/content/groups/public/org/apache/maven/plugins/maven-source-plugin/maven-metadata.xml (692 B at 5.0 KB/sec)
[INFO]                                                                         
[INFO] ------------------------------------------------------------------------
[INFO] Building ncbitaxonomy 0.91-SNAPSHOT
[INFO] ------------------------------------------------------------------------
[INFO] 
[INFO] --- maven-clean-plugin:2.4.1:clean (default-clean) @ ncbitaxonomy ---
[INFO] 
[INFO] --- cobertura-maven-plugin:2.5.1:clean (clean) @ ncbitaxonomy ---
[INFO] Skipping cobertura mojo for project with packaging type 'pom'
Mar 21, 2013 3:49:16 AM hudson.maven.ExecutedMojo <init>
WARNING: Failed to getClass for org.apache.maven.plugin.source.SourceJarMojo
[INFO] 
[INFO] --- maven-source-plugin:2.2.1:jar (default-cli) @ ncbitaxonomy ---
[INFO] 
[INFO] --- maven-jar-plugin:2.4:test-jar (default) @ ncbitaxonomy ---
[WARNING] JAR will be empty - no content was marked for inclusion!
[INFO] Building jar: /media/ephemeral0/workspace/ncbitaxonomy/target/ncbitaxonomy-0.91-SNAPSHOT-tests.jar
[INFO] [WARNING] JAR will be empty - no content was marked for inclusion!

[INFO] --- maven-jar-plugin:2.4:jar (default) @ ncbitaxonomy ---
[INFO] Building jar: /media/ephemeral0/workspace/ncbitaxonomy/target/ncbitaxonomy-0.91-SNAPSHOT.jar
[WARNING] JAR will be empty - no content was marked for inclusion!
[INFO] 
[INFO] --- maven-jar-plugin:2.4:test-jar (default-cli) @ ncbitaxonomy ---
[WARNING] Artifact edu.berkeley.compbio:ncbitaxonomy:test-jar:tests:0.91-SNAPSHOT already attached to project, ignoring duplicate
[INFO]                                                                         
[INFO] ------------------------------------------------------------------------
[INFO] Building ncbitaxonomyClient 0.91-SNAPSHOT
[INFO] ------------------------------------------------------------------------
[INFO] 
[INFO] --- maven-clean-plugin:2.4.1:clean (default-clean) @ ncbitaxonomyClient ---
[INFO] 
[INFO] --- cobertura-maven-plugin:2.5.1:clean (clean) @ ncbitaxonomyClient ---
Mar 21, 2013 3:49:24 AM hudson.maven.ExecutedMojo <init>
WARNING: Failed to getClass for org.apache.maven.plugin.source.SourceJarMojo
[INFO] 
[INFO] --- maven-source-plugin:2.2.1:jar (default-cli) @ ncbitaxonomyClient ---
[INFO] Building jar: /media/ephemeral0/workspace/ncbitaxonomy/ncbitaxonomyClient/target/ncbitaxonomyClient-0.91-SNAPSHOT-sources.jar
[INFO] 
[INFO] --- maven-resources-plugin:2.5:resources (default-resources) @ ncbitaxonomyClient ---
[debug] execute contextualize
[INFO] Using 'UTF-8' encoding to copy filtered resources.
[INFO] Copying 1 resource
[INFO] 
[INFO] --- maven-compiler-plugin:2.4:compile (default-compile) @ ncbitaxonomyClient ---
[INFO] Compiling 10 source files to /media/ephemeral0/workspace/ncbitaxonomy/ncbitaxonomyClient/target/classes
[INFO] -------------------------------------------------------------
[ERROR] COMPILATION ERROR : 
[INFO] -------------------------------------------------------------
[ERROR] /media/ephemeral0/workspace/ncbitaxonomy/ncbitaxonomyClient/src/main/java/edu/berkeley/compbio/ncbitaxonomy/service/NcbiTaxonomyClient.java:[16,34] package org.springframework.context does not exist
[ERROR] /media/ephemeral0/workspace/ncbitaxonomy/ncbitaxonomyClient/src/main/java/edu/berkeley/compbio/ncbitaxonomy/service/NcbiTaxonomyWithUnitBranchLengthsClient.java:[11,34] package org.springframework.context does not exist
[ERROR] /media/ephemeral0/workspace/ncbitaxonomy/ncbitaxonomyClient/src/main/java/edu/berkeley/compbio/ncbitaxonomy/service/NcbiTaxonomyServicesContextFactory.java:[7,47] package org.springframework.beans.factory.config does not exist
[ERROR] /media/ephemeral0/workspace/ncbitaxonomy/ncbitaxonomyClient/src/main/java/edu/berkeley/compbio/ncbitaxonomy/service/NcbiTaxonomyServicesContextFactory.java:[8,44] package org.springframework.beans.factory.xml does not exist
[ERROR] /media/ephemeral0/workspace/ncbitaxonomy/ncbitaxonomyClient/src/main/java/edu/berkeley/compbio/ncbitaxonomy/service/NcbiTaxonomyServicesContextFactory.java:[9,34] package org.springframework.context does not exist
[ERROR] /media/ephemeral0/workspace/ncbitaxonomy/ncbitaxonomyClient/src/main/java/edu/berkeley/compbio/ncbitaxonomy/service/NcbiTaxonomyServicesContextFactory.java:[10,42] package org.springframework.context.support does not exist
[ERROR] /media/ephemeral0/workspace/ncbitaxonomy/ncbitaxonomyClient/src/main/java/edu/berkeley/compbio/ncbitaxonomy/service/NcbiTaxonomyServicesContextFactory.java:[27,15] cannot find symbol
symbol  : class ApplicationContext
location: class edu.berkeley.compbio.ncbitaxonomy.service.NcbiTaxonomyServicesContextFactory
[ERROR] /media/ephemeral0/workspace/ncbitaxonomy/ncbitaxonomyClient/src/main/java/edu/berkeley/compbio/ncbitaxonomy/service/NcbiCiccarelliHybridClient.java:[12,34] package org.springframework.context does not exist
[ERROR] /media/ephemeral0/workspace/ncbitaxonomy/ncbitaxonomyClient/src/main/java/edu/berkeley/compbio/ncbitaxonomy/service/NcbiTaxonomyClient.java:[122,2] cannot find symbol
symbol  : class ApplicationContext
location: class edu.berkeley.compbio.ncbitaxonomy.service.NcbiTaxonomyClient
[ERROR] /media/ephemeral0/workspace/ncbitaxonomy/ncbitaxonomyClient/src/main/java/edu/berkeley/compbio/ncbitaxonomy/service/NcbiTaxonomyWithUnitBranchLengthsClient.java:[73,2] cannot find symbol
symbol  : class ApplicationContext
location: class edu.berkeley.compbio.ncbitaxonomy.service.NcbiTaxonomyWithUnitBranchLengthsClient
[ERROR] /media/ephemeral0/workspace/ncbitaxonomy/ncbitaxonomyClient/src/main/java/edu/berkeley/compbio/ncbitaxonomy/service/NcbiTaxonomyServicesContextFactory.java:[50,2] cannot find symbol
symbol  : class GenericApplicationContext
location: class edu.berkeley.compbio.ncbitaxonomy.service.NcbiTaxonomyServicesContextFactory
[ERROR] /media/ephemeral0/workspace/ncbitaxonomy/ncbitaxonomyClient/src/main/java/edu/berkeley/compbio/ncbitaxonomy/service/NcbiTaxonomyServicesContextFactory.java:[50,38] cannot find symbol
symbol  : class GenericApplicationContext
location: class edu.berkeley.compbio.ncbitaxonomy.service.NcbiTaxonomyServicesContextFactory
[ERROR] /media/ephemeral0/workspace/ncbitaxonomy/ncbitaxonomyClient/src/main/java/edu/berkeley/compbio/ncbitaxonomy/service/NcbiTaxonomyServicesContextFactory.java:[51,2] cannot find symbol
symbol  : class XmlBeanDefinitionReader
location: class edu.berkeley.compbio.ncbitaxonomy.service.NcbiTaxonomyServicesContextFactory
[ERROR] /media/ephemeral0/workspace/ncbitaxonomy/ncbitaxonomyClient/src/main/java/edu/berkeley/compbio/ncbitaxonomy/service/NcbiTaxonomyServicesContextFactory.java:[51,42] cannot find symbol
symbol  : class XmlBeanDefinitionReader
location: class edu.berkeley.compbio.ncbitaxonomy.service.NcbiTaxonomyServicesContextFactory
[ERROR] /media/ephemeral0/workspace/ncbitaxonomy/ncbitaxonomyClient/src/main/java/edu/berkeley/compbio/ncbitaxonomy/service/NcbiTaxonomyServicesContextFactory.java:[54,2] cannot find symbol
symbol  : class PropertyPlaceholderConfigurer
location: class edu.berkeley.compbio.ncbitaxonomy.service.NcbiTaxonomyServicesContextFactory
[ERROR] /media/ephemeral0/workspace/ncbitaxonomy/ncbitaxonomyClient/src/main/java/edu/berkeley/compbio/ncbitaxonomy/service/NcbiTaxonomyServicesContextFactory.java:[54,42] cannot find symbol
symbol  : class PropertyPlaceholderConfigurer
location: class edu.berkeley.compbio.ncbitaxonomy.service.NcbiTaxonomyServicesContextFactory
[ERROR] /media/ephemeral0/workspace/ncbitaxonomy/ncbitaxonomyClient/src/main/java/edu/berkeley/compbio/ncbitaxonomy/service/NcbiCiccarelliHybridClient.java:[54,2] cannot find symbol
symbol  : class ApplicationContext
location: class edu.berkeley.compbio.ncbitaxonomy.service.NcbiCiccarelliHybridClient
[INFO] 17 errors 
[INFO] -------------------------------------------------------------
[INFO] ------------------------------------------------------------------------
[INFO] Reactor Summary:
[INFO] 
[INFO] ncbitaxonomy ...................................... SUCCESS [20.249s]
[INFO] ncbitaxonomyClient ................................ FAILURE [7.860s]
[INFO] ncbitaxonomyServer ................................ SKIPPED
[INFO] ------------------------------------------------------------------------
[INFO] BUILD FAILURE
[INFO] ------------------------------------------------------------------------
[INFO] Total time: 38.624s
[INFO] Finished at: Thu Mar 21 03:49:31 UTC 2013
[INFO] Final Memory: 14M/34M
[INFO] ------------------------------------------------------------------------
[JENKINS] Archiving /media/ephemeral0/workspace/ncbitaxonomy/ncbitaxonomyServer/pom.xml to /usr/share/apache-tomcat-7.0.22/.jenkins/jobs/ncbitaxonomy/modules/edu.berkeley.compbio$ncbitaxonomyServer/builds/2013-03-20_23-48-41/archive/edu.berkeley.compbio/ncbitaxonomyServer/0.91-SNAPSHOT/ncbitaxonomyServer-0.91-SNAPSHOT.pom
[JENKINS] Archiving /media/ephemeral0/workspace/ncbitaxonomy/pom.xml to /usr/share/apache-tomcat-7.0.22/.jenkins/jobs/ncbitaxonomy/modules/edu.berkeley.compbio$ncbitaxonomy/builds/2013-03-20_23-48-41/archive/edu.berkeley.compbio/ncbitaxonomy/0.91-SNAPSHOT/ncbitaxonomy-0.91-SNAPSHOT.pom
[JENKINS] Re-archiving /media/ephemeral0/workspace/ncbitaxonomy/target/ncbitaxonomy-0.91-SNAPSHOT.jar
[JENKINS] Archiving /media/ephemeral0/workspace/ncbitaxonomy/target/ncbitaxonomy-0.91-SNAPSHOT-tests.jar to /usr/share/apache-tomcat-7.0.22/.jenkins/jobs/ncbitaxonomy/modules/edu.berkeley.compbio$ncbitaxonomy/builds/2013-03-20_23-48-41/archive/edu.berkeley.compbio/ncbitaxonomy/0.91-SNAPSHOT/ncbitaxonomy-0.91-SNAPSHOT-tests.jar
[JENKINS] Archiving /media/ephemeral0/workspace/ncbitaxonomy/ncbitaxonomyClient/pom.xml to /usr/share/apache-tomcat-7.0.22/.jenkins/jobs/ncbitaxonomy/modules/edu.berkeley.compbio$ncbitaxonomyClient/builds/2013-03-20_23-48-41/archive/edu.berkeley.compbio/ncbitaxonomyClient/0.91-SNAPSHOT/ncbitaxonomyClient-0.91-SNAPSHOT.pom
[JENKINS] Archiving /media/ephemeral0/workspace/ncbitaxonomy/ncbitaxonomyClient/target/ncbitaxonomyClient-0.91-SNAPSHOT-sources.jar to /usr/share/apache-tomcat-7.0.22/.jenkins/jobs/ncbitaxonomy/modules/edu.berkeley.compbio$ncbitaxonomyClient/builds/2013-03-20_23-48-41/archive/edu.berkeley.compbio/ncbitaxonomyClient/0.91-SNAPSHOT/ncbitaxonomyClient-0.91-SNAPSHOT-sources.jar
Waiting for Jenkins to finish collecting data
mavenExecutionResult exceptions not empty
message : Failed to execute goal org.apache.maven.plugins:maven-compiler-plugin:2.4:compile (default-compile) on project ncbitaxonomyClient: Compilation failure
cause : Compilation failure
Stack trace : 
org.apache.maven.lifecycle.LifecycleExecutionException: Failed to execute goal org.apache.maven.plugins:maven-compiler-plugin:2.4:compile (default-compile) on project ncbitaxonomyClient: Compilation failure
	at org.apache.maven.lifecycle.internal.MojoExecutor.execute(MojoExecutor.java:213)
	at org.apache.maven.lifecycle.internal.MojoExecutor.execute(MojoExecutor.java:153)
	at org.apache.maven.lifecycle.internal.MojoExecutor.execute(MojoExecutor.java:145)
	at org.apache.maven.lifecycle.internal.LifecycleModuleBuilder.buildProject(LifecycleModuleBuilder.java:84)
	at org.apache.maven.lifecycle.internal.LifecycleModuleBuilder.buildProject(LifecycleModuleBuilder.java:59)
	at org.apache.maven.lifecycle.internal.LifecycleStarter.singleThreadedBuild(LifecycleStarter.java:183)
	at org.apache.maven.lifecycle.internal.LifecycleStarter.execute(LifecycleStarter.java:161)
	at org.apache.maven.DefaultMaven.doExecute(DefaultMaven.java:320)
	at org.apache.maven.DefaultMaven.execute(DefaultMaven.java:156)
	at org.jvnet.hudson.maven3.launcher.Maven3Launcher.main(Maven3Launcher.java:79)
	at sun.reflect.NativeMethodAccessorImpl.invoke0(Native Method)
	at sun.reflect.NativeMethodAccessorImpl.invoke(NativeMethodAccessorImpl.java:39)
	at sun.reflect.DelegatingMethodAccessorImpl.invoke(DelegatingMethodAccessorImpl.java:25)
	at java.lang.reflect.Method.invoke(Method.java:597)
	at org.codehaus.plexus.classworlds.launcher.Launcher.launchStandard(Launcher.java:329)
	at org.codehaus.plexus.classworlds.launcher.Launcher.launch(Launcher.java:239)
	at org.jvnet.hudson.maven3.agent.Maven3Main.launch(Maven3Main.java:158)
	at hudson.maven.Maven3Builder.call(Maven3Builder.java:100)
	at hudson.maven.Maven3Builder.call(Maven3Builder.java:66)
	at hudson.remoting.UserRequest.perform(UserRequest.java:118)
	at hudson.remoting.UserRequest.perform(UserRequest.java:48)
	at hudson.remoting.Request$2.run(Request.java:326)
	at hudson.remoting.InterceptingExecutorService$1.call(InterceptingExecutorService.java:72)
	at java.util.concurrent.FutureTask$Sync.innerRun(FutureTask.java:303)
	at java.util.concurrent.FutureTask.run(FutureTask.java:138)
	at java.util.concurrent.ThreadPoolExecutor$Worker.runTask(ThreadPoolExecutor.java:886)
	at java.util.concurrent.ThreadPoolExecutor$Worker.run(ThreadPoolExecutor.java:908)
	at java.lang.Thread.run(Thread.java:662)
Caused by: org.apache.maven.plugin.CompilationFailureException: Compilation failure
	at org.apache.maven.plugin.AbstractCompilerMojo.execute(AbstractCompilerMojo.java:678)
	at org.apache.maven.plugin.CompilerMojo.execute(CompilerMojo.java:128)
	at org.apache.maven.plugin.DefaultBuildPluginManager.executeMojo(DefaultBuildPluginManager.java:101)
	at org.apache.maven.lifecycle.internal.MojoExecutor.execute(MojoExecutor.java:209)
	... 27 more
channel stopped
Sending e-mails to: dev@davidsoergel.com
Finished: FAILURE