FailedConsole Output

Started by user soergel
Building remotely on i-675a4d18 in workspace /media/ephemeral0/workspace/ncbitaxonomy
$ hg clone --rev default --noupdate ssh://jenkins@dev.davidsoergel.com//home/hg/ncbitaxonomy /media/ephemeral0/workspace/ncbitaxonomy
adding changesets
adding manifests
adding file changes
added 277 changesets with 805 changes to 114 files
[ncbitaxonomy] $ hg update --rev default
61 files updated, 0 files merged, 0 files removed, 0 files unresolved
[ncbitaxonomy] $ hg log --rev . --template {node}
[ncbitaxonomy] $ hg log --rev . --template {rev}
[ncbitaxonomy] $ hg log --rev 5fa96adc5f5b9fc09fdd0f3ad63ef97ea7305d19
[ncbitaxonomy] $ hg log --template "<changeset node='{node}' author='{author|xmlescape}' rev='{rev}' date='{date}'><msg>{desc|xmlescape}</msg><added>{file_adds|stringify|xmlescape}</added><deleted>{file_dels|stringify|xmlescape}</deleted><files>{files|stringify|xmlescape}</files><parents>{parents}</parents></changeset>\n" --rev default:0 --follow --prune 5fa96adc5f5b9fc09fdd0f3ad63ef97ea7305d19
Parsing POMs
[ncbitaxonomy] $ java -Xmx1024M -XX:MaxPermSize=256M -cp /media/ephemeral0/maven3-agent.jar:/media/ephemeral0/tools/Maven/Maven_3.0.4/boot/plexus-classworlds-2.4.jar org.jvnet.hudson.maven3.agent.Maven3Main /media/ephemeral0/tools/Maven/Maven_3.0.4 /tmp/slave.jar /media/ephemeral0/maven3-interceptor.jar 59121
<===[JENKINS REMOTING CAPACITY]===>channel started
log4j:WARN No appenders could be found for logger (org.apache.commons.beanutils.converters.BooleanConverter).
log4j:WARN Please initialize the log4j system properly.
Executing Maven:  -B -f /media/ephemeral0/workspace/ncbitaxonomy/pom.xml -U -e clean source:jar package jar:test-jar
[INFO] Error stacktraces are turned on.
[INFO] Scanning for projects...
[INFO] ------------------------------------------------------------------------
[INFO] Reactor Build Order:
[INFO] 
[INFO] ncbitaxonomy
[INFO] ncbitaxonomyClient
[INFO] ncbitaxonomyServer
Projects to build: [MavenProject: edu.berkeley.compbio:ncbitaxonomy:0.91-SNAPSHOT @ /media/ephemeral0/workspace/ncbitaxonomy/pom.xml, MavenProject: edu.berkeley.compbio:ncbitaxonomyClient:0.91-SNAPSHOT @ /media/ephemeral0/workspace/ncbitaxonomy/ncbitaxonomyClient/pom.xml, MavenProject: edu.berkeley.compbio:ncbitaxonomyServer:0.91-SNAPSHOT @ /media/ephemeral0/workspace/ncbitaxonomy/ncbitaxonomyServer/pom.xml]
Downloading: http://repo.maven.apache.org/maven2/org/codehaus/mojo/maven-metadata.xml
Downloading: http://dev.davidsoergel.com/nexus/content/groups/public/org/apache/maven/plugins/maven-metadata.xml
Downloading: http://repo.maven.apache.org/maven2/org/apache/maven/plugins/maven-metadata.xml
Downloading: http://dev.davidsoergel.com/nexus/content/groups/public/org/codehaus/mojo/maven-metadata.xml
Downloaded: http://repo.maven.apache.org/maven2/org/apache/maven/plugins/maven-metadata.xml (11 KB at 10.7 KB/sec)
Downloaded: http://repo.maven.apache.org/maven2/org/codehaus/mojo/maven-metadata.xml (21 KB at 20.8 KB/sec)
Downloaded: http://dev.davidsoergel.com/nexus/content/groups/public/org/apache/maven/plugins/maven-metadata.xml (11 KB at 2.5 KB/sec)
Downloaded: http://dev.davidsoergel.com/nexus/content/groups/public/org/codehaus/mojo/maven-metadata.xml (21 KB at 4.8 KB/sec)
Downloading: http://dev.davidsoergel.com/nexus/content/groups/public/org/apache/maven/plugins/maven-source-plugin/maven-metadata.xml
Downloading: http://repo.maven.apache.org/maven2/org/apache/maven/plugins/maven-source-plugin/maven-metadata.xml
Downloaded: http://repo.maven.apache.org/maven2/org/apache/maven/plugins/maven-source-plugin/maven-metadata.xml (692 B at 33.8 KB/sec)
Downloaded: http://dev.davidsoergel.com/nexus/content/groups/public/org/apache/maven/plugins/maven-source-plugin/maven-metadata.xml (692 B at 4.8 KB/sec)
projectStarted edu.berkeley.compbio:ncbitaxonomy:0.91-SNAPSHOT
[INFO]                                                                         
[INFO] ------------------------------------------------------------------------
[INFO] Building ncbitaxonomy 0.91-SNAPSHOT
[INFO] ------------------------------------------------------------------------
mojoStarted org.apache.maven.plugins:maven-clean-plugin:2.4.1(default-clean)
[INFO] 
[INFO] --- maven-clean-plugin:2.4.1:clean (default-clean) @ ncbitaxonomy ---
mojoSucceeded org.apache.maven.plugins:maven-clean-plugin:2.4.1(default-clean)
[INFO] Skipping cobertura mojo for project with packaging type 'pom'
mojoStarted org.codehaus.mojo:cobertura-maven-plugin:2.5.1(clean)
[INFO] 
[INFO] --- cobertura-maven-plugin:2.5.1:clean (clean) @ ncbitaxonomy ---
mojoSucceeded org.codehaus.mojo:cobertura-maven-plugin:2.5.1(clean)
Dec 2, 2012 12:21:49 AM hudson.maven.ExecutedMojo <init>
WARNING: Failed to getClass for org.apache.maven.plugin.source.SourceJarMojo
mojoStarted org.apache.maven.plugins:maven-source-plugin:2.2.1(default-cli)
[INFO] 
[INFO] --- maven-source-plugin:2.2.1:jar (default-cli) @ ncbitaxonomy ---
mojoSucceeded org.apache.maven.plugins:maven-source-plugin:2.2.1(default-cli)
mojoStarted org.apache.maven.plugins:maven-jar-plugin:2.4(default)
[INFO] 
[INFO] --- maven-jar-plugin:2.4:test-jar (default) @ ncbitaxonomy ---
Downloading: http://dev.davidsoergel.com/nexus/content/groups/public/org/codehaus/plexus/plexus-archiver/2.1/plexus-archiver-2.1.jar
Downloading: http://dev.davidsoergel.com/nexus/content/groups/public/org/codehaus/plexus/plexus-io/2.0.2/plexus-io-2.0.2.jar
Downloading: http://dev.davidsoergel.com/nexus/content/groups/public/commons-lang/commons-lang/2.1/commons-lang-2.1.jar
Downloaded: http://dev.davidsoergel.com/nexus/content/groups/public/org/codehaus/plexus/plexus-io/2.0.2/plexus-io-2.0.2.jar (57 KB at 110.7 KB/sec)
Downloaded: http://dev.davidsoergel.com/nexus/content/groups/public/commons-lang/commons-lang/2.1/commons-lang-2.1.jar (203 KB at 219.3 KB/sec)
Downloaded: http://dev.davidsoergel.com/nexus/content/groups/public/org/codehaus/plexus/plexus-archiver/2.1/plexus-archiver-2.1.jar (181 KB at 191.4 KB/sec)
[WARNING] JAR will be empty - no content was marked for inclusion!
[INFO] Building jar: /media/ephemeral0/workspace/ncbitaxonomy/target/ncbitaxonomy-0.91-SNAPSHOT-tests.jar
mojoSucceeded org.apache.maven.plugins:maven-jar-plugin:2.4(default)
mojoStarted org.apache.maven.plugins:maven-jar-plugin:2.4(default)
[WARNING] JAR will be empty - no content was marked for inclusion!
[INFO] 
[INFO] --- maven-jar-plugin:2.4:jar (default) @ ncbitaxonomy ---
[INFO] Building jar: /media/ephemeral0/workspace/ncbitaxonomy/target/ncbitaxonomy-0.91-SNAPSHOT.jar
mojoSucceeded org.apache.maven.plugins:maven-jar-plugin:2.4(default)
mojoStarted org.apache.maven.plugins:maven-jar-plugin:2.4(default-cli)
[WARNING] JAR will be empty - no content was marked for inclusion!
[INFO] 
[INFO] --- maven-jar-plugin:2.4:test-jar (default-cli) @ ncbitaxonomy ---
[WARNING] Artifact edu.berkeley.compbio:ncbitaxonomy:test-jar:tests:0.91-SNAPSHOT already attached to project, ignoring duplicate
mojoSucceeded org.apache.maven.plugins:maven-jar-plugin:2.4(default-cli)
projectSucceeded edu.berkeley.compbio:ncbitaxonomy:0.91-SNAPSHOT
projectStarted edu.berkeley.compbio:ncbitaxonomyClient:0.91-SNAPSHOT
Downloading: http://dev.davidsoergel.com/nexus/content/groups/public/com/caucho/hessian/3.1.3/hessian-3.1.3.pom
[INFO]                                                                         
[INFO] ------------------------------------------------------------------------
[INFO] Building ncbitaxonomyClient 0.91-SNAPSHOT
[INFO] ------------------------------------------------------------------------
Downloaded: http://dev.davidsoergel.com/nexus/content/groups/public/com/caucho/hessian/3.1.3/hessian-3.1.3.pom (623 B at 4.5 KB/sec)
Downloading: http://dev.davidsoergel.com/nexus/content/groups/public/edu/berkeley/compbio/phyloutils/0.92/phyloutils-0.92.pom
Downloaded: http://dev.davidsoergel.com/nexus/content/groups/public/edu/berkeley/compbio/phyloutils/0.92/phyloutils-0.92.pom (7 KB at 39.0 KB/sec)
Downloading: http://dev.davidsoergel.com/nexus/content/groups/public/org/springframework/spring/2.5.6/spring-2.5.6.pom
Downloaded: http://dev.davidsoergel.com/nexus/content/groups/public/org/springframework/spring/2.5.6/spring-2.5.6.pom (13 KB at 56.2 KB/sec)
Downloading: http://dev.davidsoergel.com/nexus/content/groups/public/com/caucho/hessian/3.1.3/hessian-3.1.3.jar
Downloading: http://dev.davidsoergel.com/nexus/content/groups/public/edu/berkeley/compbio/phyloutils/0.92/phyloutils-0.92.jar
Downloading: http://dev.davidsoergel.com/nexus/content/groups/public/org/springframework/spring/2.5.6/spring-2.5.6.jar
Downloaded: http://dev.davidsoergel.com/nexus/content/groups/public/com/caucho/hessian/3.1.3/hessian-3.1.3.jar (267 KB at 641.0 KB/sec)
Downloaded: http://dev.davidsoergel.com/nexus/content/groups/public/org/springframework/spring/2.5.6/spring-2.5.6.jar (2881 KB at 3474.5 KB/sec)
Downloaded: http://dev.davidsoergel.com/nexus/content/groups/public/edu/berkeley/compbio/phyloutils/0.92/phyloutils-0.92.jar (2793 KB at 2687.3 KB/sec)
mojoStarted org.apache.maven.plugins:maven-clean-plugin:2.4.1(default-clean)
[INFO] 
[INFO] --- maven-clean-plugin:2.4.1:clean (default-clean) @ ncbitaxonomyClient ---
mojoSucceeded org.apache.maven.plugins:maven-clean-plugin:2.4.1(default-clean)
mojoStarted org.codehaus.mojo:cobertura-maven-plugin:2.5.1(clean)
[INFO] 
[INFO] --- cobertura-maven-plugin:2.5.1:clean (clean) @ ncbitaxonomyClient ---
mojoSucceeded org.codehaus.mojo:cobertura-maven-plugin:2.5.1(clean)
Dec 2, 2012 12:21:58 AM hudson.maven.ExecutedMojo <init>
WARNING: Failed to getClass for org.apache.maven.plugin.source.SourceJarMojo
mojoStarted org.apache.maven.plugins:maven-source-plugin:2.2.1(default-cli)
[INFO] 
[INFO] --- maven-source-plugin:2.2.1:jar (default-cli) @ ncbitaxonomyClient ---
[INFO] Building jar: /media/ephemeral0/workspace/ncbitaxonomy/ncbitaxonomyClient/target/ncbitaxonomyClient-0.91-SNAPSHOT-sources.jar
mojoSucceeded org.apache.maven.plugins:maven-source-plugin:2.2.1(default-cli)
mojoStarted org.apache.maven.plugins:maven-resources-plugin:2.5(default-resources)
[INFO] 
[INFO] --- maven-resources-plugin:2.5:resources (default-resources) @ ncbitaxonomyClient ---
[debug] execute contextualize
[INFO] Using 'UTF-8' encoding to copy filtered resources.
[INFO] Copying 1 resource
mojoSucceeded org.apache.maven.plugins:maven-resources-plugin:2.5(default-resources)
mojoStarted org.apache.maven.plugins:maven-compiler-plugin:2.4(default-compile)
[INFO] 
[INFO] --- maven-compiler-plugin:2.4:compile (default-compile) @ ncbitaxonomyClient ---
[INFO] Compiling 10 source files to /media/ephemeral0/workspace/ncbitaxonomy/ncbitaxonomyClient/target/classes
[INFO] -------------------------------------------------------------
[ERROR] COMPILATION ERROR : 
[INFO] -------------------------------------------------------------
[ERROR] Failure executing javac, but could not parse the error:
javac: invalid target release: 1.7
Usage: javac <options> <source files>
use -help for a list of possible options

[INFO] 1 error
[INFO] -------------------------------------------------------------
mojoFailed org.apache.maven.plugins:maven-compiler-plugin:2.4(default-compile)
projectFailed edu.berkeley.compbio:ncbitaxonomyClient:0.91-SNAPSHOT
sessionEnded
[INFO] ------------------------------------------------------------------------
[INFO] Reactor Summary:
[INFO] 
[INFO] ncbitaxonomy ...................................... SUCCESS [54.065s]
[INFO] ncbitaxonomyClient ................................ FAILURE [9.052s]
[INFO] ncbitaxonomyServer ................................ SKIPPED
[INFO] ------------------------------------------------------------------------
[INFO] BUILD FAILURE
[INFO] ------------------------------------------------------------------------
[INFO] Total time: 1:23.400s
[INFO] Finished at: Sun Dec 02 00:22:05 UTC 2012
[INFO] Final Memory: 10M/25M
[INFO] ------------------------------------------------------------------------
Projects to build: [MavenProject: edu.berkeley.compbio:ncbitaxonomy:0.91-SNAPSHOT @ /media/ephemeral0/workspace/ncbitaxonomy/pom.xml, MavenProject: edu.berkeley.compbio:ncbitaxonomyClient:0.91-SNAPSHOT @ /media/ephemeral0/workspace/ncbitaxonomy/ncbitaxonomyClient/pom.xml, MavenProject: edu.berkeley.compbio:ncbitaxonomyServer:0.91-SNAPSHOT @ /media/ephemeral0/workspace/ncbitaxonomy/ncbitaxonomyServer/pom.xml]
[JENKINS] Archiving /media/ephemeral0/workspace/ncbitaxonomy/ncbitaxonomyServer/pom.xml to /usr/share/apache-tomcat-7.0.22/.jenkins/jobs/ncbitaxonomy/modules/edu.berkeley.compbio$ncbitaxonomyServer/builds/2012-12-01_19-20-02/archive/edu.berkeley.compbio/ncbitaxonomyServer/0.91-SNAPSHOT/ncbitaxonomyServer-0.91-SNAPSHOT.pom
[JENKINS] Archiving /media/ephemeral0/workspace/ncbitaxonomy/pom.xml to /usr/share/apache-tomcat-7.0.22/.jenkins/jobs/ncbitaxonomy/modules/edu.berkeley.compbio$ncbitaxonomy/builds/2012-12-01_19-20-02/archive/edu.berkeley.compbio/ncbitaxonomy/0.91-SNAPSHOT/ncbitaxonomy-0.91-SNAPSHOT.pom
[JENKINS] Re-archiving /media/ephemeral0/workspace/ncbitaxonomy/target/ncbitaxonomy-0.91-SNAPSHOT.jar
[JENKINS] Archiving /media/ephemeral0/workspace/ncbitaxonomy/target/ncbitaxonomy-0.91-SNAPSHOT-tests.jar to /usr/share/apache-tomcat-7.0.22/.jenkins/jobs/ncbitaxonomy/modules/edu.berkeley.compbio$ncbitaxonomy/builds/2012-12-01_19-20-02/archive/edu.berkeley.compbio/ncbitaxonomy/0.91-SNAPSHOT/ncbitaxonomy-0.91-SNAPSHOT-tests.jar
[JENKINS] Archiving /media/ephemeral0/workspace/ncbitaxonomy/ncbitaxonomyClient/pom.xml to /usr/share/apache-tomcat-7.0.22/.jenkins/jobs/ncbitaxonomy/modules/edu.berkeley.compbio$ncbitaxonomyClient/builds/2012-12-01_19-20-02/archive/edu.berkeley.compbio/ncbitaxonomyClient/0.91-SNAPSHOT/ncbitaxonomyClient-0.91-SNAPSHOT.pom
[JENKINS] Archiving /media/ephemeral0/workspace/ncbitaxonomy/ncbitaxonomyClient/target/ncbitaxonomyClient-0.91-SNAPSHOT-sources.jar to /usr/share/apache-tomcat-7.0.22/.jenkins/jobs/ncbitaxonomy/modules/edu.berkeley.compbio$ncbitaxonomyClient/builds/2012-12-01_19-20-02/archive/edu.berkeley.compbio/ncbitaxonomyClient/0.91-SNAPSHOT/ncbitaxonomyClient-0.91-SNAPSHOT-sources.jar
Waiting for Jenkins to finish collecting data
mavenExecutionResult exceptions not empty
message : Failed to execute goal org.apache.maven.plugins:maven-compiler-plugin:2.4:compile (default-compile) on project ncbitaxonomyClient: Compilation failure
Failure executing javac, but could not parse the error:
javac: invalid target release: 1.7
Usage: javac <options> <source files>
use -help for a list of possible options


cause : Compilation failure
Failure executing javac, but could not parse the error:
javac: invalid target release: 1.7
Usage: javac <options> <source files>
use -help for a list of possible options


Stack trace : 
org.apache.maven.lifecycle.LifecycleExecutionException: Failed to execute goal org.apache.maven.plugins:maven-compiler-plugin:2.4:compile (default-compile) on project ncbitaxonomyClient: Compilation failure
Failure executing javac, but could not parse the error:
javac: invalid target release: 1.7
Usage: javac <options> <source files>
use -help for a list of possible options


	at org.apache.maven.lifecycle.internal.MojoExecutor.execute(MojoExecutor.java:213)
	at org.apache.maven.lifecycle.internal.MojoExecutor.execute(MojoExecutor.java:153)
	at org.apache.maven.lifecycle.internal.MojoExecutor.execute(MojoExecutor.java:145)
	at org.apache.maven.lifecycle.internal.LifecycleModuleBuilder.buildProject(LifecycleModuleBuilder.java:84)
	at org.apache.maven.lifecycle.internal.LifecycleModuleBuilder.buildProject(LifecycleModuleBuilder.java:59)
	at org.apache.maven.lifecycle.internal.LifecycleStarter.singleThreadedBuild(LifecycleStarter.java:183)
	at org.apache.maven.lifecycle.internal.LifecycleStarter.execute(LifecycleStarter.java:161)
	at org.apache.maven.DefaultMaven.doExecute(DefaultMaven.java:320)
	at org.apache.maven.DefaultMaven.execute(DefaultMaven.java:156)
	at org.jvnet.hudson.maven3.launcher.Maven3Launcher.main(Maven3Launcher.java:79)
	at sun.reflect.NativeMethodAccessorImpl.invoke0(Native Method)
	at sun.reflect.NativeMethodAccessorImpl.invoke(NativeMethodAccessorImpl.java:39)
	at sun.reflect.DelegatingMethodAccessorImpl.invoke(DelegatingMethodAccessorImpl.java:25)
	at java.lang.reflect.Method.invoke(Method.java:597)
	at org.codehaus.plexus.classworlds.launcher.Launcher.launchStandard(Launcher.java:329)
	at org.codehaus.plexus.classworlds.launcher.Launcher.launch(Launcher.java:239)
	at org.jvnet.hudson.maven3.agent.Maven3Main.launch(Maven3Main.java:158)
	at hudson.maven.Maven3Builder.call(Maven3Builder.java:98)
	at hudson.maven.Maven3Builder.call(Maven3Builder.java:64)
	at hudson.remoting.UserRequest.perform(UserRequest.java:118)
	at hudson.remoting.UserRequest.perform(UserRequest.java:48)
	at hudson.remoting.Request$2.run(Request.java:326)
	at hudson.remoting.InterceptingExecutorService$1.call(InterceptingExecutorService.java:72)
	at java.util.concurrent.FutureTask$Sync.innerRun(FutureTask.java:303)
	at java.util.concurrent.FutureTask.run(FutureTask.java:138)
	at java.util.concurrent.ThreadPoolExecutor$Worker.runTask(ThreadPoolExecutor.java:886)
	at java.util.concurrent.ThreadPoolExecutor$Worker.run(ThreadPoolExecutor.java:908)
	at java.lang.Thread.run(Thread.java:662)
Caused by: org.apache.maven.plugin.CompilationFailureException: Compilation failure
Failure executing javac, but could not parse the error:
javac: invalid target release: 1.7
Usage: javac <options> <source files>
use -help for a list of possible options


	at org.apache.maven.plugin.AbstractCompilerMojo.execute(AbstractCompilerMojo.java:678)
	at org.apache.maven.plugin.CompilerMojo.execute(CompilerMojo.java:128)
	at org.apache.maven.plugin.DefaultBuildPluginManager.executeMojo(DefaultBuildPluginManager.java:101)
	at org.apache.maven.lifecycle.internal.MojoExecutor.execute(MojoExecutor.java:209)
	... 27 more
channel stopped
Sending e-mails to: dev@davidsoergel.com
Finished: FAILURE