FailedConsole Output

Started by an SCM change
Building remotely on i-aefcc9c0 in workspace /media/ephemeral0/workspace/ml
$ hg clone --rev default --noupdate ssh://jenkins@dev.davidsoergel.com//home/hg/ml /media/ephemeral0/workspace/ml
adding changesets
adding manifests
adding file changes
added 594 changesets with 2602 changes to 200 files
[ml] $ hg update --rev default
114 files updated, 0 files merged, 0 files removed, 0 files unresolved
[ml] $ hg log --rev . --template {node}
[ml] $ hg log --rev . --template {rev}
[ml] $ hg log --rev 5bfdf3eb95dac59ee4300fda46f7339219fa72cb
[ml] $ hg log --template "<changeset node='{node}' author='{author|xmlescape}' rev='{rev}' date='{date}'><msg>{desc|xmlescape}</msg><added>{file_adds|stringify|xmlescape}</added><deleted>{file_dels|stringify|xmlescape}</deleted><files>{files|stringify|xmlescape}</files><parents>{parents}</parents></changeset>\n" --rev default:0 --follow --prune 5bfdf3eb95dac59ee4300fda46f7339219fa72cb
Parsing POMs
Modules changed, recalculating dependency graph
[ml] $ java -Xmx1024M -XX:MaxPermSize=256M -cp /media/ephemeral0/maven3-agent.jar:/media/ephemeral0/tools/hudson.tasks.Maven_MavenInstallation/Maven_3.0.4/boot/plexus-classworlds-2.4.jar org.jvnet.hudson.maven3.agent.Maven3Main /media/ephemeral0/tools/hudson.tasks.Maven_MavenInstallation/Maven_3.0.4 /tmp/slave.jar /media/ephemeral0/maven3-interceptor.jar 57376
<===[JENKINS REMOTING CAPACITY]===>channel started
log4j:WARN No appenders could be found for logger (org.apache.commons.beanutils.converters.BooleanConverter).
log4j:WARN Please initialize the log4j system properly.
Executing Maven:  -B -f /media/ephemeral0/workspace/ml/pom.xml -U -e clean source:jar package jar:test-jar
[INFO] Error stacktraces are turned on.
[INFO] Scanning for projects...
Downloading: http://dev.davidsoergel.com/nexus/content/groups/public/org/apache/maven/plugins/maven-deploy-plugin/2.7/maven-deploy-plugin-2.7.pom
Downloaded: http://dev.davidsoergel.com/nexus/content/groups/public/org/apache/maven/plugins/maven-deploy-plugin/2.7/maven-deploy-plugin-2.7.pom (6 KB at 6.3 KB/sec)
Downloading: http://dev.davidsoergel.com/nexus/content/groups/public/org/apache/maven/plugins/maven-antrun-plugin/1.3/maven-antrun-plugin-1.3.jar
Downloaded: http://dev.davidsoergel.com/nexus/content/groups/public/org/apache/maven/plugins/maven-antrun-plugin/1.3/maven-antrun-plugin-1.3.jar (24 KB at 191.8 KB/sec)
Downloading: http://dev.davidsoergel.com/nexus/content/groups/public/org/apache/maven/plugins/maven-assembly-plugin/2.2-beta-5/maven-assembly-plugin-2.2-beta-5.pom
Downloaded: http://dev.davidsoergel.com/nexus/content/groups/public/org/apache/maven/plugins/maven-assembly-plugin/2.2-beta-5/maven-assembly-plugin-2.2-beta-5.pom (15 KB at 77.9 KB/sec)
Downloading: http://dev.davidsoergel.com/nexus/content/groups/public/org/apache/maven/plugins/maven-plugins/16/maven-plugins-16.pom
Downloaded: http://dev.davidsoergel.com/nexus/content/groups/public/org/apache/maven/plugins/maven-plugins/16/maven-plugins-16.pom (13 KB at 8.2 KB/sec)
Downloading: http://dev.davidsoergel.com/nexus/content/groups/public/org/apache/maven/plugins/maven-dependency-plugin/2.1/maven-dependency-plugin-2.1.jar
Downloaded: http://dev.davidsoergel.com/nexus/content/groups/public/org/apache/maven/plugins/maven-dependency-plugin/2.1/maven-dependency-plugin-2.1.jar (104 KB at 392.4 KB/sec)
Downloading: http://dev.davidsoergel.com/nexus/content/groups/public/org/apache/maven/plugins/maven-release-plugin/2.0/maven-release-plugin-2.0.pom
Downloaded: http://dev.davidsoergel.com/nexus/content/groups/public/org/apache/maven/plugins/maven-release-plugin/2.0/maven-release-plugin-2.0.pom (8 KB at 42.4 KB/sec)
Downloading: http://dev.davidsoergel.com/nexus/content/groups/public/org/apache/maven/release/maven-release/2.0/maven-release-2.0.pom
Downloaded: http://dev.davidsoergel.com/nexus/content/groups/public/org/apache/maven/release/maven-release/2.0/maven-release-2.0.pom (7 KB at 60.9 KB/sec)
Downloading: http://dev.davidsoergel.com/nexus/content/groups/public/org/apache/maven/plugins/maven-release-plugin/2.0/maven-release-plugin-2.0.jar
Downloaded: http://dev.davidsoergel.com/nexus/content/groups/public/org/apache/maven/plugins/maven-release-plugin/2.0/maven-release-plugin-2.0.jar (38 KB at 383.7 KB/sec)
Downloading: http://dev.davidsoergel.com/nexus/content/groups/public/org/apache/maven/plugins/maven-metadata.xml
Downloading: http://dev.davidsoergel.com/nexus/content/groups/public/org/codehaus/mojo/maven-metadata.xml
Downloading: http://repo.maven.apache.org/maven2/org/apache/maven/plugins/maven-metadata.xml
Downloading: http://repo.maven.apache.org/maven2/org/codehaus/mojo/maven-metadata.xml
Downloaded: http://repo.maven.apache.org/maven2/org/apache/maven/plugins/maven-metadata.xml (11 KB at 173.4 KB/sec)
Downloaded: http://repo.maven.apache.org/maven2/org/codehaus/mojo/maven-metadata.xml (22 KB at 350.0 KB/sec)
Downloaded: http://dev.davidsoergel.com/nexus/content/groups/public/org/apache/maven/plugins/maven-metadata.xml (11 KB at 21.7 KB/sec)
Downloaded: http://dev.davidsoergel.com/nexus/content/groups/public/org/codehaus/mojo/maven-metadata.xml (22 KB at 43.6 KB/sec)
Downloading: http://dev.davidsoergel.com/nexus/content/groups/public/org/apache/maven/plugins/maven-source-plugin/maven-metadata.xml
Downloading: http://repo.maven.apache.org/maven2/org/apache/maven/plugins/maven-source-plugin/maven-metadata.xml
Downloaded: http://repo.maven.apache.org/maven2/org/apache/maven/plugins/maven-source-plugin/maven-metadata.xml (692 B at 2.9 KB/sec)
Downloaded: http://dev.davidsoergel.com/nexus/content/groups/public/org/apache/maven/plugins/maven-source-plugin/maven-metadata.xml (692 B at 0.2 KB/sec)
Downloading: http://dev.davidsoergel.com/nexus/content/groups/public/org/apache/maven/plugins/maven-source-plugin/2.2.1/maven-source-plugin-2.2.1.pom
Downloaded: http://dev.davidsoergel.com/nexus/content/groups/public/org/apache/maven/plugins/maven-source-plugin/2.2.1/maven-source-plugin-2.2.1.pom (7 KB at 62.0 KB/sec)
Downloading: http://dev.davidsoergel.com/nexus/content/groups/public/org/apache/maven/plugins/maven-plugins/23/maven-plugins-23.pom
Downloaded: http://dev.davidsoergel.com/nexus/content/groups/public/org/apache/maven/plugins/maven-plugins/23/maven-plugins-23.pom (9 KB at 88.1 KB/sec)
Downloading: http://dev.davidsoergel.com/nexus/content/groups/public/org/apache/maven/maven-parent/22/maven-parent-22.pom
Downloaded: http://dev.davidsoergel.com/nexus/content/groups/public/org/apache/maven/maven-parent/22/maven-parent-22.pom (30 KB at 305.7 KB/sec)
Downloading: http://dev.davidsoergel.com/nexus/content/groups/public/org/apache/apache/11/apache-11.pom
Downloaded: http://dev.davidsoergel.com/nexus/content/groups/public/org/apache/apache/11/apache-11.pom (15 KB at 160.7 KB/sec)
Downloading: http://dev.davidsoergel.com/nexus/content/groups/public/org/apache/maven/plugins/maven-source-plugin/2.2.1/maven-source-plugin-2.2.1.jar
Downloaded: http://dev.davidsoergel.com/nexus/content/groups/public/org/apache/maven/plugins/maven-source-plugin/2.2.1/maven-source-plugin-2.2.1.jar (30 KB at 177.7 KB/sec)
Downloading: http://dev.davidsoergel.com/nexus/content/groups/public/com/davidsoergel/dsutils/1.051/dsutils-1.051.pom
Downloaded: http://dev.davidsoergel.com/nexus/content/groups/public/com/davidsoergel/dsutils/1.051/dsutils-1.051.pom (5 KB at 97.1 KB/sec)
Downloading: http://dev.davidsoergel.com/nexus/content/groups/public/commons-lang/commons-lang/2.6/commons-lang-2.6.pom
Downloaded: http://dev.davidsoergel.com/nexus/content/groups/public/commons-lang/commons-lang/2.6/commons-lang-2.6.pom (18 KB at 94.9 KB/sec)
Downloading: http://dev.davidsoergel.com/nexus/content/groups/public/org/apache/commons/commons-parent/17/commons-parent-17.pom
Downloaded: http://dev.davidsoergel.com/nexus/content/groups/public/org/apache/commons/commons-parent/17/commons-parent-17.pom (31 KB at 174.0 KB/sec)
Downloading: http://dev.davidsoergel.com/nexus/content/groups/public/commons-logging/commons-logging/1.1.1/commons-logging-1.1.1.pom
Downloaded: http://dev.davidsoergel.com/nexus/content/groups/public/commons-logging/commons-logging/1.1.1/commons-logging-1.1.1.pom (18 KB at 132.8 KB/sec)
Downloading: http://dev.davidsoergel.com/nexus/content/groups/public/org/apache/commons/commons-parent/5/commons-parent-5.pom
Downloaded: http://dev.davidsoergel.com/nexus/content/groups/public/org/apache/commons/commons-parent/5/commons-parent-5.pom (16 KB at 237.3 KB/sec)
Downloading: http://dev.davidsoergel.com/nexus/content/groups/public/net/sourceforge/collections/collections-generic/4.01/collections-generic-4.01.pom
Downloaded: http://dev.davidsoergel.com/nexus/content/groups/public/net/sourceforge/collections/collections-generic/4.01/collections-generic-4.01.pom (585 B at 6.8 KB/sec)
Downloading: http://dev.davidsoergel.com/nexus/content/groups/public/com/google/collections/google-collections/1.0/google-collections-1.0.pom
Downloaded: http://dev.davidsoergel.com/nexus/content/groups/public/com/google/collections/google-collections/1.0/google-collections-1.0.pom (3 KB at 11.9 KB/sec)
Downloading: http://dev.davidsoergel.com/nexus/content/groups/public/com/google/google/1/google-1.pom
Downloaded: http://dev.davidsoergel.com/nexus/content/groups/public/com/google/google/1/google-1.pom (2 KB at 14.7 KB/sec)
Downloading: http://dev.davidsoergel.com/nexus/content/groups/public/org/slf4j/slf4j-log4j12/1.6.4/slf4j-log4j12-1.6.4.pom
Downloaded: http://dev.davidsoergel.com/nexus/content/groups/public/org/slf4j/slf4j-log4j12/1.6.4/slf4j-log4j12-1.6.4.pom (2 KB at 17.2 KB/sec)
Downloading: http://dev.davidsoergel.com/nexus/content/groups/public/org/slf4j/slf4j-parent/1.6.4/slf4j-parent-1.6.4.pom
Downloaded: http://dev.davidsoergel.com/nexus/content/groups/public/org/slf4j/slf4j-parent/1.6.4/slf4j-parent-1.6.4.pom (12 KB at 140.2 KB/sec)
Downloading: http://dev.davidsoergel.com/nexus/content/groups/public/org/slf4j/slf4j-api/1.6.4/slf4j-api-1.6.4.pom
Downloaded: http://dev.davidsoergel.com/nexus/content/groups/public/org/slf4j/slf4j-api/1.6.4/slf4j-api-1.6.4.pom (3 KB at 38.1 KB/sec)
Downloading: http://dev.davidsoergel.com/nexus/content/groups/public/log4j/log4j/1.2.16/log4j-1.2.16.pom
Downloaded: http://dev.davidsoergel.com/nexus/content/groups/public/log4j/log4j/1.2.16/log4j-1.2.16.pom (20 KB at 81.4 KB/sec)
Downloading: http://dev.davidsoergel.com/nexus/content/groups/public/com/intellij/annotations/7.0.3/annotations-7.0.3.pom
Downloaded: http://dev.davidsoergel.com/nexus/content/groups/public/com/intellij/annotations/7.0.3/annotations-7.0.3.pom (2 KB at 8.3 KB/sec)
Downloading: http://dev.davidsoergel.com/nexus/content/groups/public/com/davidsoergel/conja/1.061/conja-1.061.pom
[INFO]                                                                         
[INFO] ------------------------------------------------------------------------
[INFO] Building ml 0.93-SNAPSHOT
[INFO] ------------------------------------------------------------------------
Downloading: http://repo.maven.apache.org/maven2/com/davidsoergel/conja/1.061/conja-1.061.pom
[WARNING] The POM for com.davidsoergel:conja:jar:1.061 is missing, no dependency information available
Downloading: http://dev.davidsoergel.com/nexus/content/groups/public/com/davidsoergel/trees/1.031/trees-1.031.pom
Downloaded: http://dev.davidsoergel.com/nexus/content/groups/public/com/davidsoergel/trees/1.031/trees-1.031.pom (5 KB at 33.3 KB/sec)
Downloading: http://dev.davidsoergel.com/nexus/content/groups/public/com/davidsoergel/stats/0.931/stats-0.931.pom
Downloaded: http://dev.davidsoergel.com/nexus/content/groups/public/com/davidsoergel/stats/0.931/stats-0.931.pom (5 KB at 126.2 KB/sec)
Downloading: http://dev.davidsoergel.com/nexus/content/groups/public/com/davidsoergel/runutils/0.911/runutils-0.911.pom
Downloaded: http://dev.davidsoergel.com/nexus/content/groups/public/com/davidsoergel/runutils/0.911/runutils-0.911.pom (5 KB at 37.0 KB/sec)
Downloading: http://dev.davidsoergel.com/nexus/content/groups/public/com/martiansoftware/JSAP/2.0a-ds1/JSAP-2.0a-ds1.pom
Downloaded: http://dev.davidsoergel.com/nexus/content/groups/public/com/martiansoftware/JSAP/2.0a-ds1/JSAP-2.0a-ds1.pom (246 B at 4.4 KB/sec)
Downloading: http://dev.davidsoergel.com/nexus/content/groups/public/commons-collections/commons-collections/20040616/commons-collections-20040616.pom
Downloaded: http://dev.davidsoergel.com/nexus/content/groups/public/commons-collections/commons-collections/20040616/commons-collections-20040616.pom (175 B at 4.3 KB/sec)
Downloading: http://dev.davidsoergel.com/nexus/content/groups/public/org/testng/testng/5.14.10/testng-5.14.10.pom
Downloaded: http://dev.davidsoergel.com/nexus/content/groups/public/org/testng/testng/5.14.10/testng-5.14.10.pom (7 KB at 62.1 KB/sec)
Downloading: http://dev.davidsoergel.com/nexus/content/groups/public/org/sonatype/oss/oss-parent/3/oss-parent-3.pom
Downloaded: http://dev.davidsoergel.com/nexus/content/groups/public/org/sonatype/oss/oss-parent/3/oss-parent-3.pom (4 KB at 24.8 KB/sec)
Downloading: http://dev.davidsoergel.com/nexus/content/groups/public/junit/junit/3.8.1/junit-3.8.1.pom
Downloaded: http://dev.davidsoergel.com/nexus/content/groups/public/junit/junit/3.8.1/junit-3.8.1.pom (998 B at 7.0 KB/sec)
Downloading: http://dev.davidsoergel.com/nexus/content/groups/public/org/beanshell/bsh/2.0b4/bsh-2.0b4.pom
Downloaded: http://dev.davidsoergel.com/nexus/content/groups/public/org/beanshell/bsh/2.0b4/bsh-2.0b4.pom (2 KB at 7.0 KB/sec)
Downloading: http://dev.davidsoergel.com/nexus/content/groups/public/org/beanshell/beanshell/2.0b4/beanshell-2.0b4.pom
Downloaded: http://dev.davidsoergel.com/nexus/content/groups/public/org/beanshell/beanshell/2.0b4/beanshell-2.0b4.pom (2 KB at 2.7 KB/sec)
Downloading: http://dev.davidsoergel.com/nexus/content/groups/public/com/beust/jcommander/1.12/jcommander-1.12.pom
Downloaded: http://dev.davidsoergel.com/nexus/content/groups/public/com/beust/jcommander/1.12/jcommander-1.12.pom (8 KB at 55.8 KB/sec)
Downloading: http://dev.davidsoergel.com/nexus/content/groups/public/org/yaml/snakeyaml/1.6/snakeyaml-1.6.pom
Downloaded: http://dev.davidsoergel.com/nexus/content/groups/public/org/yaml/snakeyaml/1.6/snakeyaml-1.6.pom (8 KB at 218.6 KB/sec)
Downloading: http://dev.davidsoergel.com/nexus/content/groups/public/com/davidsoergel/dsutils/1.051/dsutils-1.051.jar
Downloading: http://dev.davidsoergel.com/nexus/content/groups/public/commons-lang/commons-lang/2.6/commons-lang-2.6.jar
Downloading: http://dev.davidsoergel.com/nexus/content/groups/public/commons-logging/commons-logging/1.1.1/commons-logging-1.1.1.jar
Downloading: http://dev.davidsoergel.com/nexus/content/groups/public/net/sourceforge/collections/collections-generic/4.01/collections-generic-4.01.jar
Downloading: http://dev.davidsoergel.com/nexus/content/groups/public/com/google/collections/google-collections/1.0/google-collections-1.0.jar
Downloaded: http://dev.davidsoergel.com/nexus/content/groups/public/commons-logging/commons-logging/1.1.1/commons-logging-1.1.1.jar (60 KB at 125.0 KB/sec)
Downloading: http://dev.davidsoergel.com/nexus/content/groups/public/com/davidsoergel/dsutils/1.051/dsutils-1.051-tests.jar
Downloaded: http://dev.davidsoergel.com/nexus/content/groups/public/commons-lang/commons-lang/2.6/commons-lang-2.6.jar (278 KB at 372.1 KB/sec)
Downloading: http://dev.davidsoergel.com/nexus/content/groups/public/com/davidsoergel/conja/1.061/conja-1.061.jar
Downloaded: http://dev.davidsoergel.com/nexus/content/groups/public/com/davidsoergel/dsutils/1.051/dsutils-1.051-tests.jar (96 KB at 359.4 KB/sec)
Downloading: http://dev.davidsoergel.com/nexus/content/groups/public/com/davidsoergel/trees/1.031/trees-1.031.jar
Downloaded: http://dev.davidsoergel.com/nexus/content/groups/public/com/davidsoergel/dsutils/1.051/dsutils-1.051.jar (302 KB at 343.7 KB/sec)
Downloading: http://dev.davidsoergel.com/nexus/content/groups/public/com/davidsoergel/runutils/0.911/runutils-0.911.jar
Downloaded: http://dev.davidsoergel.com/nexus/content/groups/public/net/sourceforge/collections/collections-generic/4.01/collections-generic-4.01.jar (520 KB at 593.9 KB/sec)
Downloading: http://dev.davidsoergel.com/nexus/content/groups/public/com/martiansoftware/JSAP/2.0a-ds1/JSAP-2.0a-ds1.jar
Downloaded: http://dev.davidsoergel.com/nexus/content/groups/public/com/davidsoergel/trees/1.031/trees-1.031.jar (83 KB at 616.1 KB/sec)
Downloading: http://dev.davidsoergel.com/nexus/content/groups/public/com/davidsoergel/stats/0.931/stats-0.931.jar
Downloaded: http://dev.davidsoergel.com/nexus/content/groups/public/com/google/collections/google-collections/1.0/google-collections-1.0.jar (625 KB at 748.9 KB/sec)
Downloading: http://dev.davidsoergel.com/nexus/content/groups/public/commons-collections/commons-collections/20040616/commons-collections-20040616.jar
Downloaded: http://dev.davidsoergel.com/nexus/content/groups/public/com/davidsoergel/runutils/0.911/runutils-0.911.jar (40 KB at 414.6 KB/sec)
Downloading: http://dev.davidsoergel.com/nexus/content/groups/public/org/testng/testng/5.14.10/testng-5.14.10.jar
Downloaded: http://dev.davidsoergel.com/nexus/content/groups/public/com/davidsoergel/stats/0.931/stats-0.931.jar (57 KB at 474.5 KB/sec)
Downloading: http://dev.davidsoergel.com/nexus/content/groups/public/junit/junit/3.8.1/junit-3.8.1.jar
Downloaded: http://dev.davidsoergel.com/nexus/content/groups/public/com/martiansoftware/JSAP/2.0a-ds1/JSAP-2.0a-ds1.jar (68 KB at 238.4 KB/sec)
Downloading: http://dev.davidsoergel.com/nexus/content/groups/public/org/beanshell/bsh/2.0b4/bsh-2.0b4.jar
Downloaded: http://dev.davidsoergel.com/nexus/content/groups/public/commons-collections/commons-collections/20040616/commons-collections-20040616.jar (550 KB at 1676.4 KB/sec)
Downloading: http://dev.davidsoergel.com/nexus/content/groups/public/com/beust/jcommander/1.12/jcommander-1.12.jar
Downloaded: http://dev.davidsoergel.com/nexus/content/groups/public/junit/junit/3.8.1/junit-3.8.1.jar (119 KB at 488.6 KB/sec)
Downloading: http://dev.davidsoergel.com/nexus/content/groups/public/org/yaml/snakeyaml/1.6/snakeyaml-1.6.jar
Downloaded: http://dev.davidsoergel.com/nexus/content/groups/public/org/testng/testng/5.14.10/testng-5.14.10.jar (559 KB at 1643.0 KB/sec)
Downloading: http://dev.davidsoergel.com/nexus/content/groups/public/org/slf4j/slf4j-log4j12/1.6.4/slf4j-log4j12-1.6.4.jar
Downloaded: http://dev.davidsoergel.com/nexus/content/groups/public/org/beanshell/bsh/2.0b4/bsh-2.0b4.jar (276 KB at 1151.0 KB/sec)
Downloading: http://dev.davidsoergel.com/nexus/content/groups/public/org/slf4j/slf4j-api/1.6.4/slf4j-api-1.6.4.jar
Downloaded: http://dev.davidsoergel.com/nexus/content/groups/public/com/beust/jcommander/1.12/jcommander-1.12.jar (31 KB at 192.1 KB/sec)
Downloading: http://dev.davidsoergel.com/nexus/content/groups/public/log4j/log4j/1.2.16/log4j-1.2.16.jar
Downloaded: http://dev.davidsoergel.com/nexus/content/groups/public/org/slf4j/slf4j-log4j12/1.6.4/slf4j-log4j12-1.6.4.jar (10 KB at 43.1 KB/sec)
Downloading: http://dev.davidsoergel.com/nexus/content/groups/public/com/intellij/annotations/7.0.3/annotations-7.0.3.jar
Downloaded: http://dev.davidsoergel.com/nexus/content/groups/public/org/yaml/snakeyaml/1.6/snakeyaml-1.6.jar (227 KB at 596.5 KB/sec)
Downloaded: http://dev.davidsoergel.com/nexus/content/groups/public/org/slf4j/slf4j-api/1.6.4/slf4j-api-1.6.4.jar (26 KB at 107.0 KB/sec)
Downloaded: http://dev.davidsoergel.com/nexus/content/groups/public/com/intellij/annotations/7.0.3/annotations-7.0.3.jar (6 KB at 54.1 KB/sec)
Downloaded: http://dev.davidsoergel.com/nexus/content/groups/public/log4j/log4j/1.2.16/log4j-1.2.16.jar (471 KB at 1335.9 KB/sec)
Downloading: http://repo.maven.apache.org/maven2/com/davidsoergel/conja/1.061/conja-1.061.jar
[INFO] ------------------------------------------------------------------------
[INFO] BUILD FAILURE
[INFO] ------------------------------------------------------------------------
[INFO] Total time: 34.194s
[INFO] Finished at: Thu Mar 21 01:13:04 UTC 2013
[INFO] Final Memory: 7M/25M
[INFO] ------------------------------------------------------------------------
[JENKINS] Archiving /media/ephemeral0/workspace/ml/pom.xml to /usr/share/apache-tomcat-7.0.22/.jenkins/jobs/ml/modules/edu.berkeley.compbio$ml/builds/2013-03-20_21-12-06/archive/edu.berkeley.compbio/ml/0.93-SNAPSHOT/ml-0.93-SNAPSHOT.pom
Waiting for Jenkins to finish collecting data
mavenExecutionResult exceptions not empty
message : Failed to execute goal on project ml: Could not resolve dependencies for project edu.berkeley.compbio:ml:jar:0.93-SNAPSHOT: Could not find artifact com.davidsoergel:conja:jar:1.061 in dev.davidsoergel.com (http://dev.davidsoergel.com/nexus/content/groups/public)
cause : Could not resolve dependencies for project edu.berkeley.compbio:ml:jar:0.93-SNAPSHOT: Could not find artifact com.davidsoergel:conja:jar:1.061 in dev.davidsoergel.com (http://dev.davidsoergel.com/nexus/content/groups/public)
Stack trace : 
org.apache.maven.lifecycle.LifecycleExecutionException: Failed to execute goal on project ml: Could not resolve dependencies for project edu.berkeley.compbio:ml:jar:0.93-SNAPSHOT: Could not find artifact com.davidsoergel:conja:jar:1.061 in dev.davidsoergel.com (http://dev.davidsoergel.com/nexus/content/groups/public)
	at org.apache.maven.lifecycle.internal.LifecycleDependencyResolver.getDependencies(LifecycleDependencyResolver.java:210)
	at org.apache.maven.lifecycle.internal.LifecycleDependencyResolver.resolveProjectDependencies(LifecycleDependencyResolver.java:117)
	at org.apache.maven.lifecycle.internal.MojoExecutor.ensureDependenciesAreResolved(MojoExecutor.java:258)
	at org.apache.maven.lifecycle.internal.MojoExecutor.execute(MojoExecutor.java:201)
	at org.apache.maven.lifecycle.internal.MojoExecutor.execute(MojoExecutor.java:153)
	at org.apache.maven.lifecycle.internal.MojoExecutor.execute(MojoExecutor.java:145)
	at org.apache.maven.lifecycle.internal.LifecycleModuleBuilder.buildProject(LifecycleModuleBuilder.java:84)
	at org.apache.maven.lifecycle.internal.LifecycleModuleBuilder.buildProject(LifecycleModuleBuilder.java:59)
	at org.apache.maven.lifecycle.internal.LifecycleStarter.singleThreadedBuild(LifecycleStarter.java:183)
	at org.apache.maven.lifecycle.internal.LifecycleStarter.execute(LifecycleStarter.java:161)
	at org.apache.maven.DefaultMaven.doExecute(DefaultMaven.java:320)
	at org.apache.maven.DefaultMaven.execute(DefaultMaven.java:156)
	at org.jvnet.hudson.maven3.launcher.Maven3Launcher.main(Maven3Launcher.java:79)
	at sun.reflect.NativeMethodAccessorImpl.invoke0(Native Method)
	at sun.reflect.NativeMethodAccessorImpl.invoke(NativeMethodAccessorImpl.java:39)
	at sun.reflect.DelegatingMethodAccessorImpl.invoke(DelegatingMethodAccessorImpl.java:25)
	at java.lang.reflect.Method.invoke(Method.java:597)
	at org.codehaus.plexus.classworlds.launcher.Launcher.launchStandard(Launcher.java:329)
	at org.codehaus.plexus.classworlds.launcher.Launcher.launch(Launcher.java:239)
	at org.jvnet.hudson.maven3.agent.Maven3Main.launch(Maven3Main.java:158)
	at hudson.maven.Maven3Builder.call(Maven3Builder.java:100)
	at hudson.maven.Maven3Builder.call(Maven3Builder.java:66)
	at hudson.remoting.UserRequest.perform(UserRequest.java:118)
	at hudson.remoting.UserRequest.perform(UserRequest.java:48)
	at hudson.remoting.Request$2.run(Request.java:326)
	at hudson.remoting.InterceptingExecutorService$1.call(InterceptingExecutorService.java:72)
	at java.util.concurrent.FutureTask$Sync.innerRun(FutureTask.java:303)
	at java.util.concurrent.FutureTask.run(FutureTask.java:138)
	at java.util.concurrent.ThreadPoolExecutor$Worker.runTask(ThreadPoolExecutor.java:886)
	at java.util.concurrent.ThreadPoolExecutor$Worker.run(ThreadPoolExecutor.java:908)
	at java.lang.Thread.run(Thread.java:662)
Caused by: org.apache.maven.project.DependencyResolutionException: Could not resolve dependencies for project edu.berkeley.compbio:ml:jar:0.93-SNAPSHOT: Could not find artifact com.davidsoergel:conja:jar:1.061 in dev.davidsoergel.com (http://dev.davidsoergel.com/nexus/content/groups/public)
	at org.apache.maven.project.DefaultProjectDependenciesResolver.resolve(DefaultProjectDependenciesResolver.java:189)
	at org.apache.maven.lifecycle.internal.LifecycleDependencyResolver.getDependencies(LifecycleDependencyResolver.java:185)
	... 30 more
Caused by: org.sonatype.aether.resolution.DependencyResolutionException: Could not find artifact com.davidsoergel:conja:jar:1.061 in dev.davidsoergel.com (http://dev.davidsoergel.com/nexus/content/groups/public)
	at org.sonatype.aether.impl.internal.DefaultRepositorySystem.resolveDependencies(DefaultRepositorySystem.java:375)
	at org.apache.maven.project.DefaultProjectDependenciesResolver.resolve(DefaultProjectDependenciesResolver.java:183)
	... 31 more
Caused by: org.sonatype.aether.resolution.ArtifactResolutionException: Could not find artifact com.davidsoergel:conja:jar:1.061 in dev.davidsoergel.com (http://dev.davidsoergel.com/nexus/content/groups/public)
	at org.sonatype.aether.impl.internal.DefaultArtifactResolver.resolve(DefaultArtifactResolver.java:538)
	at org.sonatype.aether.impl.internal.DefaultArtifactResolver.resolveArtifacts(DefaultArtifactResolver.java:216)
	at org.sonatype.aether.impl.internal.DefaultRepositorySystem.resolveDependencies(DefaultRepositorySystem.java:358)
	... 32 more
Caused by: org.sonatype.aether.transfer.ArtifactNotFoundException: Could not find artifact com.davidsoergel:conja:jar:1.061 in dev.davidsoergel.com (http://dev.davidsoergel.com/nexus/content/groups/public)
	at org.sonatype.aether.connector.wagon.WagonRepositoryConnector$4.wrap(WagonRepositoryConnector.java:947)
	at org.sonatype.aether.connector.wagon.WagonRepositoryConnector$4.wrap(WagonRepositoryConnector.java:941)
	at org.sonatype.aether.connector.wagon.WagonRepositoryConnector$GetTask.run(WagonRepositoryConnector.java:669)
	at org.sonatype.aether.util.concurrency.RunnableErrorForwarder$1.run(RunnableErrorForwarder.java:60)
	... 3 more
channel stopped
Sending e-mails to: dev@davidsoergel.com
Finished: FAILURE