FailedConsole Output

Started by user soergel
Building remotely on i-d20da2aa in workspace /media/ephemeral0/workspace/ml
$ hg clone --rev default --noupdate ssh://jenkins@dev.davidsoergel.com//home/hg/ml /media/ephemeral0/workspace/ml
adding changesets
adding manifests
adding file changes
added 585 changesets with 2592 changes to 200 files
[ml] $ hg update --rev default
115 files updated, 0 files merged, 0 files removed, 0 files unresolved
[ml] $ hg log --rev . --template {node}
[ml] $ hg log --rev . --template {rev}
[ml] $ hg log --rev 933d3b3e5b6c4f4afd2bc6f117f89a7551d4d857
[ml] $ hg log --template "<changeset node='{node}' author='{author|xmlescape}' rev='{rev}' date='{date}'><msg>{desc|xmlescape}</msg><added>{file_adds|stringify|xmlescape}</added><deleted>{file_dels|stringify|xmlescape}</deleted><files>{files|stringify|xmlescape}</files><parents>{parents}</parents></changeset>\n" --rev default:0 --follow --prune 933d3b3e5b6c4f4afd2bc6f117f89a7551d4d857
 your Apache Maven build is setup to use a config with id org.jenkinsci.plugins.configfiles.maven.MavenSettingsConfig1337980147845 but cannot find the config
Parsing POMs
[ml] $ /usr/java/default/bin/java -Xmx1024M -XX:MaxPermSize=256M -cp /media/ephemeral0/maven3-agent.jar:/media/ephemeral0/tools/Maven/Maven_3.0.4/boot/plexus-classworlds-2.4.jar org.jvnet.hudson.maven3.agent.Maven3Main /media/ephemeral0/tools/Maven/Maven_3.0.4 /tmp/slave.jar /media/ephemeral0/maven3-interceptor.jar 33312
<===[JENKINS REMOTING CAPACITY]===>channel started
log4j:WARN No appenders could be found for logger (org.apache.commons.beanutils.converters.BooleanConverter).
log4j:WARN Please initialize the log4j system properly.
Executing Maven:  -B -f /media/ephemeral0/workspace/ml/pom.xml -DdevelopmentVersion=0.93-SNAPSHOT -DreleaseVersion=0.92 -U -e clean -Dresume=false release:prepare release:perform
[INFO] Error stacktraces are turned on.
[INFO] Scanning for projects...
Projects to build: [MavenProject: edu.berkeley.compbio:ml:0.912-SNAPSHOT @ /media/ephemeral0/workspace/ml/pom.xml]
projectStarted edu.berkeley.compbio:ml:0.912-SNAPSHOT
[INFO]                                                                         
[INFO] ------------------------------------------------------------------------
[INFO] Building ml 0.912-SNAPSHOT
[INFO] ------------------------------------------------------------------------
mojoStarted org.apache.maven.plugins:maven-clean-plugin:2.4.1(default-clean)
[INFO] 
[INFO] --- maven-clean-plugin:2.4.1:clean (default-clean) @ ml ---
mojoSucceeded org.apache.maven.plugins:maven-clean-plugin:2.4.1(default-clean)
mojoStarted org.codehaus.mojo:cobertura-maven-plugin:2.5.1(clean)
[INFO] 
[INFO] --- cobertura-maven-plugin:2.5.1:clean (clean) @ ml ---
mojoSucceeded org.codehaus.mojo:cobertura-maven-plugin:2.5.1(clean)
projectSucceeded edu.berkeley.compbio:ml:0.912-SNAPSHOT
projectStarted edu.berkeley.compbio:ml:0.912-SNAPSHOT
[INFO]                                                                         
[INFO] ------------------------------------------------------------------------
[INFO] Building ml 0.912-SNAPSHOT
[INFO] ------------------------------------------------------------------------
mojoStarted org.apache.maven.plugins:maven-release-plugin:2.0(default-cli)
[INFO] 
[INFO] --- maven-release-plugin:2.0:prepare (default-cli) @ ml ---
[INFO] Verifying that there are no local modifications...
[INFO] EXECUTING: /bin/sh -c cd /media/ephemeral0/workspace/ml && hg status
[INFO] [release.properties:unknown]
[INFO] Checking dependencies and plugins for snapshots ...
mojoFailed org.apache.maven.plugins:maven-release-plugin:2.0(default-cli)
projectFailed edu.berkeley.compbio:ml:0.912-SNAPSHOT
sessionEnded
[INFO] ------------------------------------------------------------------------
[INFO] BUILD FAILURE
[INFO] ------------------------------------------------------------------------
[INFO] Total time: 32.278s
[INFO] Finished at: Sun Jul 08 01:06:45 UTC 2012
[INFO] Final Memory: 11M/28M
[INFO] ------------------------------------------------------------------------
Projects to build: [MavenProject: edu.berkeley.compbio:ml:0.912-SNAPSHOT @ /media/ephemeral0/workspace/ml/pom.xml]
[JENKINS] Archiving /media/ephemeral0/workspace/ml/pom.xml to /usr/share/apache-tomcat-7.0.22/.jenkins/jobs/ml/modules/edu.berkeley.compbio$ml/builds/2012-07-07_21-05-38/archive/edu.berkeley.compbio/ml/0.912-SNAPSHOT/ml-0.912-SNAPSHOT.pom
Waiting for Jenkins to finish collecting data
mavenExecutionResult exceptions not empty
message : Failed to execute goal org.apache.maven.plugins:maven-release-plugin:2.0:prepare (default-cli) on project ml: Can't release project due to non released dependencies :
    com.davidsoergel:conja:jar:1.06-SNAPSHOT:compile
in project 'ml' (edu.berkeley.compbio:ml:jar:0.912-SNAPSHOT)
cause : Can't release project due to non released dependencies :
    com.davidsoergel:conja:jar:1.06-SNAPSHOT:compile
in project 'ml' (edu.berkeley.compbio:ml:jar:0.912-SNAPSHOT)
Stack trace : 
org.apache.maven.lifecycle.LifecycleExecutionException: Failed to execute goal org.apache.maven.plugins:maven-release-plugin:2.0:prepare (default-cli) on project ml: Can't release project due to non released dependencies :
    com.davidsoergel:conja:jar:1.06-SNAPSHOT:compile
in project 'ml' (edu.berkeley.compbio:ml:jar:0.912-SNAPSHOT)
	at org.apache.maven.lifecycle.internal.MojoExecutor.execute(MojoExecutor.java:213)
	at org.apache.maven.lifecycle.internal.MojoExecutor.execute(MojoExecutor.java:153)
	at org.apache.maven.lifecycle.internal.MojoExecutor.execute(MojoExecutor.java:145)
	at org.apache.maven.lifecycle.internal.LifecycleModuleBuilder.buildProject(LifecycleModuleBuilder.java:84)
	at org.apache.maven.lifecycle.internal.LifecycleModuleBuilder.buildProject(LifecycleModuleBuilder.java:59)
	at org.apache.maven.lifecycle.internal.LifecycleStarter.singleThreadedBuild(LifecycleStarter.java:183)
	at org.apache.maven.lifecycle.internal.LifecycleStarter.execute(LifecycleStarter.java:161)
	at org.apache.maven.DefaultMaven.doExecute(DefaultMaven.java:320)
	at org.apache.maven.DefaultMaven.execute(DefaultMaven.java:156)
	at org.jvnet.hudson.maven3.launcher.Maven3Launcher.main(Maven3Launcher.java:79)
	at sun.reflect.NativeMethodAccessorImpl.invoke0(Native Method)
	at sun.reflect.NativeMethodAccessorImpl.invoke(NativeMethodAccessorImpl.java:57)
	at sun.reflect.DelegatingMethodAccessorImpl.invoke(DelegatingMethodAccessorImpl.java:43)
	at java.lang.reflect.Method.invoke(Method.java:601)
	at org.codehaus.plexus.classworlds.launcher.Launcher.launchStandard(Launcher.java:329)
	at org.codehaus.plexus.classworlds.launcher.Launcher.launch(Launcher.java:239)
	at org.jvnet.hudson.maven3.agent.Maven3Main.launch(Maven3Main.java:158)
	at hudson.maven.Maven3Builder.call(Maven3Builder.java:98)
	at hudson.maven.Maven3Builder.call(Maven3Builder.java:64)
	at hudson.remoting.UserRequest.perform(UserRequest.java:118)
	at hudson.remoting.UserRequest.perform(UserRequest.java:48)
	at hudson.remoting.Request$2.run(Request.java:326)
	at hudson.remoting.InterceptingExecutorService$1.call(InterceptingExecutorService.java:72)
	at java.util.concurrent.FutureTask$Sync.innerRun(FutureTask.java:334)
	at java.util.concurrent.FutureTask.run(FutureTask.java:166)
	at java.util.concurrent.ThreadPoolExecutor.runWorker(ThreadPoolExecutor.java:1110)
	at java.util.concurrent.ThreadPoolExecutor$Worker.run(ThreadPoolExecutor.java:603)
	at java.lang.Thread.run(Thread.java:722)
Caused by: org.apache.maven.plugin.MojoFailureException: Can't release project due to non released dependencies :
    com.davidsoergel:conja:jar:1.06-SNAPSHOT:compile
in project 'ml' (edu.berkeley.compbio:ml:jar:0.912-SNAPSHOT)
	at org.apache.maven.plugins.release.PrepareReleaseMojo.prepareRelease(PrepareReleaseMojo.java:219)
	at org.apache.maven.plugins.release.PrepareReleaseMojo.execute(PrepareReleaseMojo.java:181)
	at org.apache.maven.plugin.DefaultBuildPluginManager.executeMojo(DefaultBuildPluginManager.java:101)
	at org.apache.maven.lifecycle.internal.MojoExecutor.execute(MojoExecutor.java:209)
	... 27 more
Caused by: org.apache.maven.shared.release.ReleaseFailureException: Can't release project due to non released dependencies :
    com.davidsoergel:conja:jar:1.06-SNAPSHOT:compile
in project 'ml' (edu.berkeley.compbio:ml:jar:0.912-SNAPSHOT)
	at org.apache.maven.shared.release.phase.CheckDependencySnapshotsPhase.checkProject(CheckDependencySnapshotsPhase.java:253)
	at org.apache.maven.shared.release.phase.CheckDependencySnapshotsPhase.execute(CheckDependencySnapshotsPhase.java:109)
	at org.apache.maven.shared.release.DefaultReleaseManager.prepare(DefaultReleaseManager.java:203)
	at org.apache.maven.shared.release.DefaultReleaseManager.prepare(DefaultReleaseManager.java:140)
	at org.apache.maven.shared.release.DefaultReleaseManager.prepare(DefaultReleaseManager.java:103)
	at org.apache.maven.plugins.release.PrepareReleaseMojo.prepareRelease(PrepareReleaseMojo.java:211)
	... 30 more
channel stopped
Sending e-mails to: dev@davidsoergel.com
Finished: FAILURE