FailedConsole Output

<===[JENKINS REMOTING CAPACITY]===>channel started
log4j:WARN No appenders could be found for logger (org.apache.commons.beanutils.converters.BooleanConverter).
log4j:WARN Please initialize the log4j system properly.
Executing Maven:  -B -f /media/ephemeral0/workspace/jlibsvm/pom.xml -U -cpu -e clean source:jar package jar:test-jar
[INFO] Error stacktraces are turned on.
[WARNING] Command line option -cpu is deprecated and will be removed in future Maven versions.
[INFO] Scanning for projects...
Downloading: http://dev.davidsoergel.com/nexus/content/repositories/snapshots/com/davidsoergel/basepom/0.99-SNAPSHOT/maven-metadata.xml
Downloaded: http://dev.davidsoergel.com/nexus/content/repositories/snapshots/com/davidsoergel/basepom/0.99-SNAPSHOT/maven-metadata.xml (809 B at 1.6 KB/sec)
[WARNING] 
[WARNING] Some problems were encountered while building the effective model for edu.berkeley.compbio:jlibsvm:jar:0.91-SNAPSHOT
[WARNING] 'build.plugins.plugin.version' for org.codehaus.mojo:build-helper-maven-plugin is missing. @ line 147, column 12
[WARNING] 
[WARNING] It is highly recommended to fix these problems because they threaten the stability of your build.
[WARNING] 
[WARNING] For this reason, future Maven versions might no longer support building such malformed projects.
[WARNING] 
Projects to build: [MavenProject: edu.berkeley.compbio:jlibsvm:0.91-SNAPSHOT @ /media/ephemeral0/workspace/jlibsvm/pom.xml]
Downloading: http://dev.davidsoergel.com/nexus/content/groups/public/org/codehaus/mojo/build-helper-maven-plugin/maven-metadata.xml
Downloading: http://repo.maven.apache.org/maven2/org/codehaus/mojo/build-helper-maven-plugin/maven-metadata.xml
Downloaded: http://repo.maven.apache.org/maven2/org/codehaus/mojo/build-helper-maven-plugin/maven-metadata.xml (546 B at 5.7 KB/sec)
Downloaded: http://dev.davidsoergel.com/nexus/content/groups/public/org/codehaus/mojo/build-helper-maven-plugin/maven-metadata.xml (546 B at 0.5 KB/sec)
Downloading: http://dev.davidsoergel.com/nexus/content/groups/public/org/apache/maven/plugins/maven-metadata.xml
Downloading: http://repo.maven.apache.org/maven2/org/apache/maven/plugins/maven-metadata.xml
Downloading: http://dev.davidsoergel.com/nexus/content/groups/public/org/codehaus/mojo/maven-metadata.xml
Downloading: http://repo.maven.apache.org/maven2/org/codehaus/mojo/maven-metadata.xml
Downloaded: http://repo.maven.apache.org/maven2/org/apache/maven/plugins/maven-metadata.xml (11 KB at 395.5 KB/sec)
Downloaded: http://dev.davidsoergel.com/nexus/content/groups/public/org/apache/maven/plugins/maven-metadata.xml (11 KB at 38.2 KB/sec)
Downloaded: http://repo.maven.apache.org/maven2/org/codehaus/mojo/maven-metadata.xml (21 KB at 77.0 KB/sec)
Downloaded: http://dev.davidsoergel.com/nexus/content/groups/public/org/codehaus/mojo/maven-metadata.xml (21 KB at 49.3 KB/sec)
Downloading: http://dev.davidsoergel.com/nexus/content/groups/public/org/apache/maven/plugins/maven-source-plugin/maven-metadata.xml
Downloading: http://repo.maven.apache.org/maven2/org/apache/maven/plugins/maven-source-plugin/maven-metadata.xml
Downloaded: http://dev.davidsoergel.com/nexus/content/groups/public/org/apache/maven/plugins/maven-source-plugin/maven-metadata.xml (632 B at 2.6 KB/sec)
Downloaded: http://repo.maven.apache.org/maven2/org/apache/maven/plugins/maven-source-plugin/maven-metadata.xml (632 B at 1.4 KB/sec)
projectStarted edu.berkeley.compbio:jlibsvm:0.91-SNAPSHOT
[INFO]                                                                         
[INFO] ------------------------------------------------------------------------
[INFO] Building jlibsvm 0.91-SNAPSHOT
[INFO] ------------------------------------------------------------------------
Downloading: http://dev.davidsoergel.com/nexus/content/repositories/snapshots/com/davidsoergel/dsutils/1.04-SNAPSHOT/maven-metadata.xml
Downloaded: http://dev.davidsoergel.com/nexus/content/repositories/snapshots/com/davidsoergel/dsutils/1.04-SNAPSHOT/maven-metadata.xml (2 KB at 7.4 KB/sec)
Downloading: http://dev.davidsoergel.com/nexus/content/repositories/snapshots/com/davidsoergel/conja/1.06-SNAPSHOT/maven-metadata.xml
Downloaded: http://dev.davidsoergel.com/nexus/content/repositories/snapshots/com/davidsoergel/conja/1.06-SNAPSHOT/maven-metadata.xml (2 KB at 11.9 KB/sec)
Downloading: http://dev.davidsoergel.com/nexus/content/repositories/snapshots/com/davidsoergel/conja/1.06-SNAPSHOT/conja-1.06-20120706.124516-4.pom
Downloaded: http://dev.davidsoergel.com/nexus/content/repositories/snapshots/com/davidsoergel/conja/1.06-SNAPSHOT/conja-1.06-20120706.124516-4.pom (4 KB at 102.7 KB/sec)
Downloading: http://dev.davidsoergel.com/nexus/content/repositories/snapshots/edu/berkeley/compbio/ml/0.912-SNAPSHOT/maven-metadata.xml
Downloaded: http://dev.davidsoergel.com/nexus/content/repositories/snapshots/edu/berkeley/compbio/ml/0.912-SNAPSHOT/maven-metadata.xml (2 KB at 10.0 KB/sec)
Downloading: http://dev.davidsoergel.com/nexus/content/repositories/snapshots/edu/berkeley/compbio/ml/0.912-SNAPSHOT/ml-0.912-20120706.132009-8.pom
Downloaded: http://dev.davidsoergel.com/nexus/content/repositories/snapshots/edu/berkeley/compbio/ml/0.912-SNAPSHOT/ml-0.912-20120706.132009-8.pom (7 KB at 44.8 KB/sec)
Downloading: http://dev.davidsoergel.com/nexus/content/repositories/snapshots/com/davidsoergel/trees/1.023-SNAPSHOT/maven-metadata.xml
Downloaded: http://dev.davidsoergel.com/nexus/content/repositories/snapshots/com/davidsoergel/trees/1.023-SNAPSHOT/maven-metadata.xml (2 KB at 12.6 KB/sec)
Downloading: http://dev.davidsoergel.com/nexus/content/repositories/snapshots/com/davidsoergel/stats/0.93-SNAPSHOT/maven-metadata.xml
Downloaded: http://dev.davidsoergel.com/nexus/content/repositories/snapshots/com/davidsoergel/stats/0.93-SNAPSHOT/maven-metadata.xml (2 KB at 36.5 KB/sec)
Downloading: http://dev.davidsoergel.com/nexus/content/repositories/snapshots/com/davidsoergel/stats/0.93-SNAPSHOT/stats-0.93-20120706.131607-11.pom
Downloaded: http://dev.davidsoergel.com/nexus/content/repositories/snapshots/com/davidsoergel/stats/0.93-SNAPSHOT/stats-0.93-20120706.131607-11.pom (4 KB at 130.2 KB/sec)
Downloading: http://dev.davidsoergel.com/nexus/content/repositories/snapshots/com/davidsoergel/runutils/0.91-SNAPSHOT/maven-metadata.xml
Downloaded: http://dev.davidsoergel.com/nexus/content/repositories/snapshots/com/davidsoergel/runutils/0.91-SNAPSHOT/maven-metadata.xml (2 KB at 16.7 KB/sec)
Downloading: http://dev.davidsoergel.com/nexus/content/repositories/snapshots/com/davidsoergel/runutils/0.91-SNAPSHOT/runutils-0.91-20120706.131159-12.pom
Downloaded: http://dev.davidsoergel.com/nexus/content/repositories/snapshots/com/davidsoergel/runutils/0.91-SNAPSHOT/runutils-0.91-20120706.131159-12.pom (5 KB at 104.9 KB/sec)
Downloading: http://dev.davidsoergel.com/nexus/content/repositories/snapshots/com/davidsoergel/conja/1.06-SNAPSHOT/conja-1.06-20120706.124516-4.jar
Downloading: http://dev.davidsoergel.com/nexus/content/repositories/snapshots/edu/berkeley/compbio/ml/0.912-SNAPSHOT/ml-0.912-20120706.132009-8.jar
Downloading: http://dev.davidsoergel.com/nexus/content/repositories/snapshots/com/davidsoergel/runutils/0.91-SNAPSHOT/runutils-0.91-20120706.131159-12.jar
Downloading: http://dev.davidsoergel.com/nexus/content/repositories/snapshots/com/davidsoergel/stats/0.93-SNAPSHOT/stats-0.93-20120706.131607-11.jar
Downloaded: http://dev.davidsoergel.com/nexus/content/repositories/snapshots/com/davidsoergel/conja/1.06-SNAPSHOT/conja-1.06-20120706.124516-4.jar (31 KB at 252.0 KB/sec)
Downloaded: http://dev.davidsoergel.com/nexus/content/repositories/snapshots/com/davidsoergel/runutils/0.91-SNAPSHOT/runutils-0.91-20120706.131159-12.jar (40 KB at 183.6 KB/sec)
Downloaded: http://dev.davidsoergel.com/nexus/content/repositories/snapshots/com/davidsoergel/stats/0.93-SNAPSHOT/stats-0.93-20120706.131607-11.jar (57 KB at 258.4 KB/sec)
Downloaded: http://dev.davidsoergel.com/nexus/content/repositories/snapshots/edu/berkeley/compbio/ml/0.912-SNAPSHOT/ml-0.912-20120706.132009-8.jar (195 KB at 798.7 KB/sec)
mojoStarted org.apache.maven.plugins:maven-clean-plugin:2.4.1(default-clean)
[INFO] 
[INFO] --- maven-clean-plugin:2.4.1:clean (default-clean) @ jlibsvm ---
mojoSucceeded org.apache.maven.plugins:maven-clean-plugin:2.4.1(default-clean)
mojoStarted org.codehaus.mojo:cobertura-maven-plugin:2.5.1(clean)
[INFO] 
[INFO] --- cobertura-maven-plugin:2.5.1:clean (clean) @ jlibsvm ---
mojoSucceeded org.codehaus.mojo:cobertura-maven-plugin:2.5.1(clean)
mojoStarted org.apache.maven.plugins:maven-source-plugin:2.1.2(default-cli)
[INFO] 
[INFO] --- maven-source-plugin:2.1.2:jar (default-cli) @ jlibsvm ---
Jul 06, 2012 1:23:44 PM hudson.maven.ExecutedMojo <init>
WARNING: Failed to getClass for org.apache.maven.plugin.source.SourceJarMojo
[INFO] Building jar: /media/ephemeral0/workspace/jlibsvm/target/jlibsvm-0.91-SNAPSHOT-sources.jar
mojoSucceeded org.apache.maven.plugins:maven-source-plugin:2.1.2(default-cli)
mojoStarted org.apache.maven.plugins:maven-resources-plugin:2.5(default-resources)
[INFO] 
[INFO] --- maven-resources-plugin:2.5:resources (default-resources) @ jlibsvm ---
[debug] execute contextualize
[INFO] Using 'UTF-8' encoding to copy filtered resources.
[INFO] Copying 1 resource
mojoSucceeded org.apache.maven.plugins:maven-resources-plugin:2.5(default-resources)
mojoStarted org.apache.maven.plugins:maven-compiler-plugin:2.4(default-compile)
[INFO] 
[INFO] --- maven-compiler-plugin:2.4:compile (default-compile) @ jlibsvm ---
[INFO] Compiling 88 source files to /media/ephemeral0/workspace/jlibsvm/target/classes
[INFO] -------------------------------------------------------------
[ERROR] COMPILATION ERROR : 
[INFO] -------------------------------------------------------------
[ERROR] /media/ephemeral0/workspace/jlibsvm/src/main/java/edu/berkeley/compbio/jlibsvm/legacyexec/svm_train.java:[38,45] NotImplementedException is internal proprietary API and may be removed in a future release
[ERROR] /media/ephemeral0/workspace/jlibsvm/src/main/java/edu/berkeley/compbio/jlibsvm/SVM.java:[6,21] NotImplementedException is internal proprietary API and may be removed in a future release
[ERROR] /media/ephemeral0/workspace/jlibsvm/src/main/java/edu/berkeley/compbio/jlibsvm/ImmutableSvmParameter.java:[29,36] NotImplementedException is internal proprietary API and may be removed in a future release
[ERROR] /media/ephemeral0/workspace/jlibsvm/src/main/java/edu/berkeley/compbio/jlibsvm/SolutionModel.java:[141,12] NotImplementedException is internal proprietary API and may be removed in a future release
[ERROR] /media/ephemeral0/workspace/jlibsvm/src/main/java/edu/berkeley/compbio/jlibsvm/SolutionModel.java:[146,12] NotImplementedException is internal proprietary API and may be removed in a future release
[ERROR] /media/ephemeral0/workspace/jlibsvm/src/main/java/edu/berkeley/compbio/jlibsvm/multi/MultiClassModel.java:[635,18] NotImplementedException is internal proprietary API and may be removed in a future release
[ERROR] /media/ephemeral0/workspace/jlibsvm/src/main/java/edu/berkeley/compbio/jlibsvm/binary/AlphaModel.java:[117,23] error: cannot find symbol
[ERROR]   symbol:   method toPrimitiveArray(List<Double>)
  location: class DSArrayUtils
/media/ephemeral0/workspace/jlibsvm/src/main/java/edu/berkeley/compbio/jlibsvm/legacyexec/svm_train.java:[557,13] NotImplementedException is internal proprietary API and may be removed in a future release
[INFO] 8 errors 
[INFO] -------------------------------------------------------------
mojoFailed org.apache.maven.plugins:maven-compiler-plugin:2.4(default-compile)
projectFailed edu.berkeley.compbio:jlibsvm:0.91-SNAPSHOT
sessionEnded
[INFO] ------------------------------------------------------------------------
[INFO] BUILD FAILURE
[INFO] ------------------------------------------------------------------------
[INFO] Total time: 50.295s
[INFO] Finished at: Fri Jul 06 13:24:09 UTC 2012
[INFO] Final Memory: 17M/53M
[INFO] ------------------------------------------------------------------------
Projects to build: [MavenProject: edu.berkeley.compbio:jlibsvm:0.91-SNAPSHOT @ /media/ephemeral0/workspace/jlibsvm/pom.xml]
[JENKINS] Archiving /media/ephemeral0/workspace/jlibsvm/pom.xml to /usr/share/apache-tomcat-7.0.22/.jenkins/jobs/jlibsvm/modules/edu.berkeley.compbio$jlibsvm/builds/2012-07-06_09-23-00/archive/edu.berkeley.compbio/jlibsvm/0.91-SNAPSHOT/jlibsvm-0.91-SNAPSHOT.pom
[JENKINS] Archiving /media/ephemeral0/workspace/jlibsvm/target/jlibsvm-0.91-SNAPSHOT-sources.jar to /usr/share/apache-tomcat-7.0.22/.jenkins/jobs/jlibsvm/modules/edu.berkeley.compbio$jlibsvm/builds/2012-07-06_09-23-00/archive/edu.berkeley.compbio/jlibsvm/0.91-SNAPSHOT/jlibsvm-0.91-SNAPSHOT-sources.jar
Waiting for Jenkins to finish collecting data
mavenExecutionResult exceptions not empty
message : Failed to execute goal org.apache.maven.plugins:maven-compiler-plugin:2.4:compile (default-compile) on project jlibsvm: Compilation failure
cause : Compilation failure
Stack trace : 
org.apache.maven.lifecycle.LifecycleExecutionException: Failed to execute goal org.apache.maven.plugins:maven-compiler-plugin:2.4:compile (default-compile) on project jlibsvm: Compilation failure
	at org.apache.maven.lifecycle.internal.MojoExecutor.execute(MojoExecutor.java:213)
	at org.apache.maven.lifecycle.internal.MojoExecutor.execute(MojoExecutor.java:153)
	at org.apache.maven.lifecycle.internal.MojoExecutor.execute(MojoExecutor.java:145)
	at org.apache.maven.lifecycle.internal.LifecycleModuleBuilder.buildProject(LifecycleModuleBuilder.java:84)
	at org.apache.maven.lifecycle.internal.LifecycleModuleBuilder.buildProject(LifecycleModuleBuilder.java:59)
	at org.apache.maven.lifecycle.internal.LifecycleStarter.singleThreadedBuild(LifecycleStarter.java:183)
	at org.apache.maven.lifecycle.internal.LifecycleStarter.execute(LifecycleStarter.java:161)
	at org.apache.maven.DefaultMaven.doExecute(DefaultMaven.java:320)
	at org.apache.maven.DefaultMaven.execute(DefaultMaven.java:156)
	at org.jvnet.hudson.maven3.launcher.Maven3Launcher.main(Maven3Launcher.java:79)
	at sun.reflect.NativeMethodAccessorImpl.invoke0(Native Method)
	at sun.reflect.NativeMethodAccessorImpl.invoke(NativeMethodAccessorImpl.java:57)
	at sun.reflect.DelegatingMethodAccessorImpl.invoke(DelegatingMethodAccessorImpl.java:43)
	at java.lang.reflect.Method.invoke(Method.java:601)
	at org.codehaus.plexus.classworlds.launcher.Launcher.launchStandard(Launcher.java:329)
	at org.codehaus.plexus.classworlds.launcher.Launcher.launch(Launcher.java:239)
	at org.jvnet.hudson.maven3.agent.Maven3Main.launch(Maven3Main.java:158)
	at hudson.maven.Maven3Builder.call(Maven3Builder.java:98)
	at hudson.maven.Maven3Builder.call(Maven3Builder.java:64)
	at hudson.remoting.UserRequest.perform(UserRequest.java:118)
	at hudson.remoting.UserRequest.perform(UserRequest.java:48)
	at hudson.remoting.Request$2.run(Request.java:326)
	at hudson.remoting.InterceptingExecutorService$1.call(InterceptingExecutorService.java:72)
	at java.util.concurrent.FutureTask$Sync.innerRun(FutureTask.java:334)
	at java.util.concurrent.FutureTask.run(FutureTask.java:166)
	at java.util.concurrent.ThreadPoolExecutor.runWorker(ThreadPoolExecutor.java:1110)
	at java.util.concurrent.ThreadPoolExecutor$Worker.run(ThreadPoolExecutor.java:603)
	at java.lang.Thread.run(Thread.java:722)
Caused by: org.apache.maven.plugin.CompilationFailureException: Compilation failure
	at org.apache.maven.plugin.AbstractCompilerMojo.execute(AbstractCompilerMojo.java:678)
	at org.apache.maven.plugin.CompilerMojo.execute(CompilerMojo.java:128)
	at org.apache.maven.plugin.DefaultBuildPluginManager.executeMojo(DefaultBuildPluginManager.java:101)
	at org.apache.maven.lifecycle.internal.MojoExecutor.execute(MojoExecutor.java:209)
	... 27 more