FailedConsole Output

Started by user soergel
Building remotely on i-635a4d1c in workspace /media/ephemeral0/workspace/jlibsvm
$ hg clone --rev default --noupdate ssh://jenkins@dev.davidsoergel.com//home/hg/jlibsvm /media/ephemeral0/workspace/jlibsvm
adding changesets
adding manifests
adding file changes
added 185 changesets with 1107 changes to 175 files
[jlibsvm] $ hg update --rev default
150 files updated, 0 files merged, 0 files removed, 0 files unresolved
[jlibsvm] $ hg log --rev . --template {node}
[jlibsvm] $ hg log --rev . --template {rev}
[jlibsvm] $ hg log --rev d2f868416694ab86b17f2974ea7937fcb644a7a1
[jlibsvm] $ hg log --template "<changeset node='{node}' author='{author|xmlescape}' rev='{rev}' date='{date}'><msg>{desc|xmlescape}</msg><added>{file_adds|stringify|xmlescape}</added><deleted>{file_dels|stringify|xmlescape}</deleted><files>{files|stringify|xmlescape}</files><parents>{parents}</parents></changeset>\n" --rev default:0 --follow --prune d2f868416694ab86b17f2974ea7937fcb644a7a1
Parsing POMs
Downloaded artifact http://dev.davidsoergel.com/nexus/content/groups/public//com/davidsoergel/basepom/1.0/basepom-1.0.pom
[jlibsvm] $ java -Xmx1024M -XX:MaxPermSize=256M -cp /media/ephemeral0/maven3-agent.jar:/media/ephemeral0/tools/Maven/Maven_3.0.4/boot/plexus-classworlds-2.4.jar org.jvnet.hudson.maven3.agent.Maven3Main /media/ephemeral0/tools/Maven/Maven_3.0.4 /tmp/slave.jar /media/ephemeral0/maven3-interceptor.jar 40482
<===[JENKINS REMOTING CAPACITY]===>channel started
log4j:WARN No appenders could be found for logger (org.apache.commons.beanutils.converters.BooleanConverter).
log4j:WARN Please initialize the log4j system properly.
Executing Maven:  -B -f /media/ephemeral0/workspace/jlibsvm/pom.xml -U -e clean source:jar package jar:test-jar
[INFO] Error stacktraces are turned on.
[INFO] Scanning for projects...
Downloading: http://dev.davidsoergel.com/nexus/content/groups/public/org/apache/maven/wagon/wagon-ssh-external/1.0/wagon-ssh-external-1.0.pom
Downloaded: http://dev.davidsoergel.com/nexus/content/groups/public/org/apache/maven/wagon/wagon-ssh-external/1.0/wagon-ssh-external-1.0.pom (3 KB at 1.9 KB/sec)
Downloading: http://dev.davidsoergel.com/nexus/content/groups/public/org/apache/maven/wagon/wagon-providers/1.0/wagon-providers-1.0.pom
Downloaded: http://dev.davidsoergel.com/nexus/content/groups/public/org/apache/maven/wagon/wagon-providers/1.0/wagon-providers-1.0.pom (3 KB at 3.2 KB/sec)
Downloading: http://dev.davidsoergel.com/nexus/content/groups/public/org/apache/maven/wagon/wagon/1.0/wagon-1.0.pom
Downloaded: http://dev.davidsoergel.com/nexus/content/groups/public/org/apache/maven/wagon/wagon/1.0/wagon-1.0.pom (10 KB at 64.9 KB/sec)
Downloading: http://dev.davidsoergel.com/nexus/content/groups/public/org/apache/maven/maven-parent/20/maven-parent-20.pom
Downloaded: http://dev.davidsoergel.com/nexus/content/groups/public/org/apache/maven/maven-parent/20/maven-parent-20.pom (25 KB at 122.0 KB/sec)
Downloading: http://dev.davidsoergel.com/nexus/content/groups/public/org/apache/apache/9/apache-9.pom
Downloaded: http://dev.davidsoergel.com/nexus/content/groups/public/org/apache/apache/9/apache-9.pom (15 KB at 58.1 KB/sec)
Downloading: http://dev.davidsoergel.com/nexus/content/groups/public/org/codehaus/plexus/plexus-utils/1.4.2/plexus-utils-1.4.2.pom
Downloaded: http://dev.davidsoergel.com/nexus/content/groups/public/org/codehaus/plexus/plexus-utils/1.4.2/plexus-utils-1.4.2.pom (2 KB at 11.0 KB/sec)
Downloading: http://dev.davidsoergel.com/nexus/content/groups/public/org/codehaus/plexus/plexus/1.0.11/plexus-1.0.11.pom
Downloaded: http://dev.davidsoergel.com/nexus/content/groups/public/org/codehaus/plexus/plexus/1.0.11/plexus-1.0.11.pom (9 KB at 45.4 KB/sec)
Downloading: http://dev.davidsoergel.com/nexus/content/groups/public/org/apache/maven/wagon/wagon-ssh-common/1.0/wagon-ssh-common-1.0.pom
Downloaded: http://dev.davidsoergel.com/nexus/content/groups/public/org/apache/maven/wagon/wagon-ssh-common/1.0/wagon-ssh-common-1.0.pom (2 KB at 8.7 KB/sec)
Downloading: http://dev.davidsoergel.com/nexus/content/groups/public/org/codehaus/plexus/plexus-interactivity-api/1.0-alpha-6/plexus-interactivity-api-1.0-alpha-6.pom
Downloaded: http://dev.davidsoergel.com/nexus/content/groups/public/org/codehaus/plexus/plexus-interactivity-api/1.0-alpha-6/plexus-interactivity-api-1.0-alpha-6.pom (726 B at 0.3 KB/sec)
Downloading: http://dev.davidsoergel.com/nexus/content/groups/public/org/codehaus/plexus/plexus-interactivity/1.0-alpha-6/plexus-interactivity-1.0-alpha-6.pom
Downloaded: http://dev.davidsoergel.com/nexus/content/groups/public/org/codehaus/plexus/plexus-interactivity/1.0-alpha-6/plexus-interactivity-1.0-alpha-6.pom (2 KB at 2.7 KB/sec)
Downloading: http://dev.davidsoergel.com/nexus/content/groups/public/org/codehaus/plexus/plexus/1.0.10/plexus-1.0.10.pom
Downloaded: http://dev.davidsoergel.com/nexus/content/groups/public/org/codehaus/plexus/plexus/1.0.10/plexus-1.0.10.pom (9 KB at 46.3 KB/sec)
Downloading: http://dev.davidsoergel.com/nexus/content/groups/public/org/apache/maven/wagon/wagon-provider-api/1.0/wagon-provider-api-1.0.pom
Downloaded: http://dev.davidsoergel.com/nexus/content/groups/public/org/apache/maven/wagon/wagon-provider-api/1.0/wagon-provider-api-1.0.pom (2 KB at 6.0 KB/sec)
Downloading: http://dev.davidsoergel.com/nexus/content/groups/public/org/apache/maven/wagon/wagon-ssh-external/1.0/wagon-ssh-external-1.0.jar
Downloading: http://dev.davidsoergel.com/nexus/content/groups/public/org/apache/maven/wagon/wagon-ssh-common/1.0/wagon-ssh-common-1.0.jar
Downloading: http://dev.davidsoergel.com/nexus/content/groups/public/org/codehaus/plexus/plexus-utils/1.4.2/plexus-utils-1.4.2.jar
Downloading: http://dev.davidsoergel.com/nexus/content/groups/public/org/codehaus/plexus/plexus-interactivity-api/1.0-alpha-6/plexus-interactivity-api-1.0-alpha-6.jar
Downloaded: http://dev.davidsoergel.com/nexus/content/groups/public/org/apache/maven/wagon/wagon-ssh-external/1.0/wagon-ssh-external-1.0.jar (15 KB at 11.1 KB/sec)
Downloaded: http://dev.davidsoergel.com/nexus/content/groups/public/org/codehaus/plexus/plexus-utils/1.4.2/plexus-utils-1.4.2.jar (186 KB at 154.4 KB/sec)
Downloaded: http://dev.davidsoergel.com/nexus/content/groups/public/org/codehaus/plexus/plexus-interactivity-api/1.0-alpha-6/plexus-interactivity-api-1.0-alpha-6.jar (12 KB at 3.6 KB/sec)
Downloaded: http://dev.davidsoergel.com/nexus/content/groups/public/org/apache/maven/wagon/wagon-ssh-common/1.0/wagon-ssh-common-1.0.jar (26 KB at 7.7 KB/sec)
Downloading: http://dev.davidsoergel.com/nexus/content/groups/public/org/apache/maven/wagon/wagon-webdav/1.0-beta-2/wagon-webdav-1.0-beta-2.pom
Downloaded: http://dev.davidsoergel.com/nexus/content/groups/public/org/apache/maven/wagon/wagon-webdav/1.0-beta-2/wagon-webdav-1.0-beta-2.pom (2 KB at 2.8 KB/sec)
Downloading: http://dev.davidsoergel.com/nexus/content/groups/public/org/apache/maven/wagon/wagon-providers/1.0-beta-2/wagon-providers-1.0-beta-2.pom
Downloaded: http://dev.davidsoergel.com/nexus/content/groups/public/org/apache/maven/wagon/wagon-providers/1.0-beta-2/wagon-providers-1.0-beta-2.pom (2 KB at 3.8 KB/sec)
Downloading: http://dev.davidsoergel.com/nexus/content/groups/public/org/apache/maven/wagon/wagon/1.0-beta-2/wagon-1.0-beta-2.pom
Downloaded: http://dev.davidsoergel.com/nexus/content/groups/public/org/apache/maven/wagon/wagon/1.0-beta-2/wagon-1.0-beta-2.pom (6 KB at 39.6 KB/sec)
Downloading: http://dev.davidsoergel.com/nexus/content/groups/public/org/apache/maven/maven-parent/4/maven-parent-4.pom
Downloaded: http://dev.davidsoergel.com/nexus/content/groups/public/org/apache/maven/maven-parent/4/maven-parent-4.pom (10 KB at 64.2 KB/sec)
Downloading: http://dev.davidsoergel.com/nexus/content/groups/public/org/apache/apache/3/apache-3.pom
Downloaded: http://dev.davidsoergel.com/nexus/content/groups/public/org/apache/apache/3/apache-3.pom (4 KB at 7.6 KB/sec)
Downloading: http://dev.davidsoergel.com/nexus/content/groups/public/commons-httpclient/commons-httpclient/2.0.2/commons-httpclient-2.0.2.pom
Downloaded: http://dev.davidsoergel.com/nexus/content/groups/public/commons-httpclient/commons-httpclient/2.0.2/commons-httpclient-2.0.2.pom (7 KB at 3.0 KB/sec)
Downloading: http://dev.davidsoergel.com/nexus/content/groups/public/jdom/jdom/1.0/jdom-1.0.pom
Downloaded: http://dev.davidsoergel.com/nexus/content/groups/public/jdom/jdom/1.0/jdom-1.0.pom (2 KB at 7.6 KB/sec)
Downloading: http://dev.davidsoergel.com/nexus/content/groups/public/de/zeigermann/xml/xml-im-exporter/1.1/xml-im-exporter-1.1.pom
Downloaded: http://dev.davidsoergel.com/nexus/content/groups/public/de/zeigermann/xml/xml-im-exporter/1.1/xml-im-exporter-1.1.pom (248 B at 1.2 KB/sec)
Downloading: http://dev.davidsoergel.com/nexus/content/groups/public/commons-logging/commons-logging/1.0.4/commons-logging-1.0.4.pom
Downloaded: http://dev.davidsoergel.com/nexus/content/groups/public/commons-logging/commons-logging/1.0.4/commons-logging-1.0.4.pom (6 KB at 33.8 KB/sec)
Downloading: http://dev.davidsoergel.com/nexus/content/groups/public/org/apache/maven/wagon/wagon-provider-api/1.0-beta-2/wagon-provider-api-1.0-beta-2.pom
Downloaded: http://dev.davidsoergel.com/nexus/content/groups/public/org/apache/maven/wagon/wagon-provider-api/1.0-beta-2/wagon-provider-api-1.0-beta-2.pom (680 B at 0.1 KB/sec)
Downloading: http://dev.davidsoergel.com/nexus/content/groups/public/org/codehaus/plexus/plexus-utils/1.0.4/plexus-utils-1.0.4.pom
Downloaded: http://dev.davidsoergel.com/nexus/content/groups/public/org/codehaus/plexus/plexus-utils/1.0.4/plexus-utils-1.0.4.pom (7 KB at 26.6 KB/sec)
Downloading: http://dev.davidsoergel.com/nexus/content/groups/public/org/apache/maven/wagon/wagon-webdav/1.0-beta-2/wagon-webdav-1.0-beta-2.jar
Downloading: http://dev.davidsoergel.com/nexus/content/groups/public/slide/slide-webdavlib/2.1/slide-webdavlib-2.1.jar
Downloading: http://dev.davidsoergel.com/nexus/content/groups/public/commons-httpclient/commons-httpclient/2.0.2/commons-httpclient-2.0.2.jar
Downloading: http://dev.davidsoergel.com/nexus/content/groups/public/jdom/jdom/1.0/jdom-1.0.jar
Downloading: http://dev.davidsoergel.com/nexus/content/groups/public/de/zeigermann/xml/xml-im-exporter/1.1/xml-im-exporter-1.1.jar
Downloaded: http://dev.davidsoergel.com/nexus/content/groups/public/org/apache/maven/wagon/wagon-webdav/1.0-beta-2/wagon-webdav-1.0-beta-2.jar (17 KB at 53.0 KB/sec)
Downloading: http://dev.davidsoergel.com/nexus/content/groups/public/commons-logging/commons-logging/1.0.4/commons-logging-1.0.4.jar
Downloaded: http://dev.davidsoergel.com/nexus/content/groups/public/de/zeigermann/xml/xml-im-exporter/1.1/xml-im-exporter-1.1.jar (24 KB at 47.4 KB/sec)
Downloading: http://dev.davidsoergel.com/nexus/content/groups/public/org/codehaus/plexus/plexus-utils/1.0.4/plexus-utils-1.0.4.jar
Downloaded: http://dev.davidsoergel.com/nexus/content/groups/public/commons-logging/commons-logging/1.0.4/commons-logging-1.0.4.jar (38 KB at 94.7 KB/sec)
Downloaded: http://dev.davidsoergel.com/nexus/content/groups/public/slide/slide-webdavlib/2.1/slide-webdavlib-2.1.jar (169 KB at 222.5 KB/sec)
Downloaded: http://dev.davidsoergel.com/nexus/content/groups/public/commons-httpclient/commons-httpclient/2.0.2/commons-httpclient-2.0.2.jar (221 KB at 256.2 KB/sec)
Downloaded: http://dev.davidsoergel.com/nexus/content/groups/public/org/codehaus/plexus/plexus-utils/1.0.4/plexus-utils-1.0.4.jar (160 KB at 167.0 KB/sec)
Downloaded: http://dev.davidsoergel.com/nexus/content/groups/public/jdom/jdom/1.0/jdom-1.0.jar (150 KB at 96.9 KB/sec)
[WARNING] 
[WARNING] Some problems were encountered while building the effective model for edu.berkeley.compbio:jlibsvm:jar:0.92-SNAPSHOT
[WARNING] 'build.plugins.plugin.version' for org.codehaus.mojo:build-helper-maven-plugin is missing. @ line 148, column 12
[WARNING] 
[WARNING] It is highly recommended to fix these problems because they threaten the stability of your build.
[WARNING] 
[WARNING] For this reason, future Maven versions might no longer support building such malformed projects.
[WARNING] 
Projects to build: [MavenProject: edu.berkeley.compbio:jlibsvm:0.92-SNAPSHOT @ /media/ephemeral0/workspace/jlibsvm/pom.xml]
Downloading: http://dev.davidsoergel.com/nexus/content/groups/public/org/codehaus/mojo/build-helper-maven-plugin/maven-metadata.xml
Downloading: http://repo.maven.apache.org/maven2/org/codehaus/mojo/build-helper-maven-plugin/maven-metadata.xml
Downloaded: http://repo.maven.apache.org/maven2/org/codehaus/mojo/build-helper-maven-plugin/maven-metadata.xml (546 B at 2.8 KB/sec)
Downloaded: http://dev.davidsoergel.com/nexus/content/groups/public/org/codehaus/mojo/build-helper-maven-plugin/maven-metadata.xml (546 B at 0.0 KB/sec)
Downloading: http://dev.davidsoergel.com/nexus/content/groups/public/org/codehaus/mojo/build-helper-maven-plugin/1.7/build-helper-maven-plugin-1.7.pom
Downloaded: http://dev.davidsoergel.com/nexus/content/groups/public/org/codehaus/mojo/build-helper-maven-plugin/1.7/build-helper-maven-plugin-1.7.pom (6 KB at 1.5 KB/sec)
Downloading: http://dev.davidsoergel.com/nexus/content/groups/public/org/codehaus/mojo/build-helper-maven-plugin/1.7/build-helper-maven-plugin-1.7.jar
Downloaded: http://dev.davidsoergel.com/nexus/content/groups/public/org/codehaus/mojo/build-helper-maven-plugin/1.7/build-helper-maven-plugin-1.7.jar (32 KB at 8.5 KB/sec)
Downloading: http://dev.davidsoergel.com/nexus/content/groups/public/org/apache/maven/plugins/maven-metadata.xml
Downloading: http://repo.maven.apache.org/maven2/org/apache/maven/plugins/maven-metadata.xml
Downloading: http://repo.maven.apache.org/maven2/org/codehaus/mojo/maven-metadata.xml
Downloaded: http://repo.maven.apache.org/maven2/org/apache/maven/plugins/maven-metadata.xml (11 KB at 423.0 KB/sec)
Downloaded: http://repo.maven.apache.org/maven2/org/codehaus/mojo/maven-metadata.xml (21 KB at 947.7 KB/sec)
Downloading: http://dev.davidsoergel.com/nexus/content/groups/public/org/codehaus/mojo/maven-metadata.xml
Downloaded: http://dev.davidsoergel.com/nexus/content/groups/public/org/apache/maven/plugins/maven-metadata.xml (11 KB at 4.8 KB/sec)
Downloaded: http://dev.davidsoergel.com/nexus/content/groups/public/org/codehaus/mojo/maven-metadata.xml (21 KB at 9.9 KB/sec)
Downloading: http://repo.maven.apache.org/maven2/org/apache/maven/plugins/maven-source-plugin/maven-metadata.xml
Downloading: http://dev.davidsoergel.com/nexus/content/groups/public/org/apache/maven/plugins/maven-source-plugin/maven-metadata.xml
Downloaded: http://repo.maven.apache.org/maven2/org/apache/maven/plugins/maven-source-plugin/maven-metadata.xml (692 B at 8.7 KB/sec)
Downloaded: http://dev.davidsoergel.com/nexus/content/groups/public/org/apache/maven/plugins/maven-source-plugin/maven-metadata.xml (692 B at 0.5 KB/sec)
Downloading: http://dev.davidsoergel.com/nexus/content/groups/public/org/apache/maven/plugins/maven-source-plugin/2.2.1/maven-source-plugin-2.2.1.pom
Downloaded: http://dev.davidsoergel.com/nexus/content/groups/public/org/apache/maven/plugins/maven-source-plugin/2.2.1/maven-source-plugin-2.2.1.pom (7 KB at 37.2 KB/sec)
Downloading: http://dev.davidsoergel.com/nexus/content/groups/public/org/apache/maven/plugins/maven-source-plugin/2.2.1/maven-source-plugin-2.2.1.jar
Downloaded: http://dev.davidsoergel.com/nexus/content/groups/public/org/apache/maven/plugins/maven-source-plugin/2.2.1/maven-source-plugin-2.2.1.jar (30 KB at 124.2 KB/sec)
projectStarted edu.berkeley.compbio:jlibsvm:0.92-SNAPSHOT
Downloading: http://dev.davidsoergel.com/nexus/content/groups/public/com/google/collections/google-collections/1.0/google-collections-1.0.pom
[INFO]                                                                         
[INFO] ------------------------------------------------------------------------
[INFO] Building jlibsvm 0.92-SNAPSHOT
[INFO] ------------------------------------------------------------------------
Downloaded: http://dev.davidsoergel.com/nexus/content/groups/public/com/google/collections/google-collections/1.0/google-collections-1.0.pom (3 KB at 6.1 KB/sec)
Downloading: http://dev.davidsoergel.com/nexus/content/groups/public/org/slf4j/slf4j-parent/1.6.4/slf4j-parent-1.6.4.pom
Downloaded: http://dev.davidsoergel.com/nexus/content/groups/public/org/slf4j/slf4j-parent/1.6.4/slf4j-parent-1.6.4.pom (12 KB at 44.6 KB/sec)
Downloading: http://dev.davidsoergel.com/nexus/content/groups/public/org/slf4j/slf4j-api/1.6.4/slf4j-api-1.6.4.pom
Downloaded: http://dev.davidsoergel.com/nexus/content/groups/public/org/slf4j/slf4j-api/1.6.4/slf4j-api-1.6.4.pom (3 KB at 5.1 KB/sec)
Downloading: http://dev.davidsoergel.com/nexus/content/groups/public/log4j/log4j/1.2.16/log4j-1.2.16.pom
Downloaded: http://dev.davidsoergel.com/nexus/content/groups/public/log4j/log4j/1.2.16/log4j-1.2.16.pom (20 KB at 64.9 KB/sec)
Downloading: http://dev.davidsoergel.com/nexus/content/groups/public/com/intellij/annotations/7.0.3/annotations-7.0.3.pom
Downloaded: http://dev.davidsoergel.com/nexus/content/groups/public/com/intellij/annotations/7.0.3/annotations-7.0.3.pom (2 KB at 5.6 KB/sec)
Downloading: http://dev.davidsoergel.com/nexus/content/groups/public/com/davidsoergel/conja/1.06/conja-1.06.pom
Downloaded: http://dev.davidsoergel.com/nexus/content/groups/public/com/davidsoergel/conja/1.06/conja-1.06.pom (4 KB at 14.9 KB/sec)
Downloading: http://dev.davidsoergel.com/nexus/content/groups/public/edu/berkeley/compbio/ml/0.92/ml-0.92.pom
Downloaded: http://dev.davidsoergel.com/nexus/content/groups/public/edu/berkeley/compbio/ml/0.92/ml-0.92.pom (7 KB at 5.6 KB/sec)
Downloading: http://dev.davidsoergel.com/nexus/content/groups/public/com/davidsoergel/trees/1.03/trees-1.03.pom
Downloaded: http://dev.davidsoergel.com/nexus/content/groups/public/com/davidsoergel/trees/1.03/trees-1.03.pom (5 KB at 10.1 KB/sec)
Downloading: http://dev.davidsoergel.com/nexus/content/groups/public/commons-collections/commons-collections/3.2/commons-collections-3.2.pom
Downloaded: http://dev.davidsoergel.com/nexus/content/groups/public/commons-collections/commons-collections/3.2/commons-collections-3.2.pom (11 KB at 44.9 KB/sec)
Downloading: http://dev.davidsoergel.com/nexus/content/groups/public/org/testng/testng/5.14.10/testng-5.14.10.pom
Downloaded: http://dev.davidsoergel.com/nexus/content/groups/public/org/testng/testng/5.14.10/testng-5.14.10.pom (7 KB at 51.1 KB/sec)
Downloading: http://dev.davidsoergel.com/nexus/content/groups/public/org/sonatype/oss/oss-parent/3/oss-parent-3.pom
Downloaded: http://dev.davidsoergel.com/nexus/content/groups/public/org/sonatype/oss/oss-parent/3/oss-parent-3.pom (4 KB at 15.6 KB/sec)
Downloading: http://dev.davidsoergel.com/nexus/content/groups/public/junit/junit/3.8.1/junit-3.8.1.pom
Downloaded: http://dev.davidsoergel.com/nexus/content/groups/public/junit/junit/3.8.1/junit-3.8.1.pom (998 B at 10.3 KB/sec)
Downloading: http://dev.davidsoergel.com/nexus/content/groups/public/org/beanshell/bsh/2.0b4/bsh-2.0b4.pom
Downloaded: http://dev.davidsoergel.com/nexus/content/groups/public/org/beanshell/bsh/2.0b4/bsh-2.0b4.pom (2 KB at 5.7 KB/sec)
Downloading: http://dev.davidsoergel.com/nexus/content/groups/public/org/beanshell/beanshell/2.0b4/beanshell-2.0b4.pom
Downloaded: http://dev.davidsoergel.com/nexus/content/groups/public/org/beanshell/beanshell/2.0b4/beanshell-2.0b4.pom (2 KB at 9.0 KB/sec)
Downloading: http://dev.davidsoergel.com/nexus/content/groups/public/com/beust/jcommander/1.12/jcommander-1.12.pom
Downloaded: http://dev.davidsoergel.com/nexus/content/groups/public/com/beust/jcommander/1.12/jcommander-1.12.pom (8 KB at 55.8 KB/sec)
Downloading: http://dev.davidsoergel.com/nexus/content/groups/public/org/yaml/snakeyaml/1.6/snakeyaml-1.6.pom
Downloaded: http://dev.davidsoergel.com/nexus/content/groups/public/org/yaml/snakeyaml/1.6/snakeyaml-1.6.pom (8 KB at 81.1 KB/sec)
Downloading: http://dev.davidsoergel.com/nexus/content/groups/public/com/google/collections/google-collections/1.0/google-collections-1.0.jar
Downloading: http://dev.davidsoergel.com/nexus/content/groups/public/com/davidsoergel/dsutils/1.05/dsutils-1.05.jar
Downloading: http://dev.davidsoergel.com/nexus/content/groups/public/commons-lang/commons-lang/2.6/commons-lang-2.6.jar
Downloading: http://dev.davidsoergel.com/nexus/content/groups/public/commons-logging/commons-logging/1.1.1/commons-logging-1.1.1.jar
Downloading: http://dev.davidsoergel.com/nexus/content/groups/public/net/sourceforge/collections/collections-generic/4.01/collections-generic-4.01.jar
Downloaded: http://dev.davidsoergel.com/nexus/content/groups/public/com/davidsoergel/dsutils/1.05/dsutils-1.05.jar (302 KB at 911.1 KB/sec)
Downloading: http://dev.davidsoergel.com/nexus/content/groups/public/com/davidsoergel/conja/1.06/conja-1.06.jar
Downloaded: http://dev.davidsoergel.com/nexus/content/groups/public/commons-lang/commons-lang/2.6/commons-lang-2.6.jar (278 KB at 742.1 KB/sec)
Downloading: http://dev.davidsoergel.com/nexus/content/groups/public/edu/berkeley/compbio/ml/0.92/ml-0.92.jar
Downloaded: http://dev.davidsoergel.com/nexus/content/groups/public/com/google/collections/google-collections/1.0/google-collections-1.0.jar (625 KB at 1656.8 KB/sec)
Downloading: http://dev.davidsoergel.com/nexus/content/groups/public/com/davidsoergel/trees/1.03/trees-1.03.jar
Downloaded: http://dev.davidsoergel.com/nexus/content/groups/public/commons-logging/commons-logging/1.1.1/commons-logging-1.1.1.jar (60 KB at 130.5 KB/sec)
Downloading: http://dev.davidsoergel.com/nexus/content/groups/public/com/davidsoergel/runutils/0.91/runutils-0.91.jar
Downloaded: http://dev.davidsoergel.com/nexus/content/groups/public/net/sourceforge/collections/collections-generic/4.01/collections-generic-4.01.jar (520 KB at 840.0 KB/sec)
Downloading: http://dev.davidsoergel.com/nexus/content/groups/public/com/martiansoftware/JSAP/2.0a-ds1/JSAP-2.0a-ds1.jar
Downloaded: http://dev.davidsoergel.com/nexus/content/groups/public/com/davidsoergel/conja/1.06/conja-1.06.jar (31 KB at 36.2 KB/sec)
Downloading: http://dev.davidsoergel.com/nexus/content/groups/public/com/davidsoergel/stats/0.93/stats-0.93.jar
Downloaded: http://dev.davidsoergel.com/nexus/content/groups/public/edu/berkeley/compbio/ml/0.92/ml-0.92.jar (195 KB at 183.7 KB/sec)
Downloaded: http://dev.davidsoergel.com/nexus/content/groups/public/com/davidsoergel/trees/1.03/trees-1.03.jar (83 KB at 77.9 KB/sec)
Downloading: http://dev.davidsoergel.com/nexus/content/groups/public/org/testng/testng/5.14.10/testng-5.14.10.jar
Downloading: http://dev.davidsoergel.com/nexus/content/groups/public/commons-collections/commons-collections/3.2/commons-collections-3.2.jar
Downloaded: http://dev.davidsoergel.com/nexus/content/groups/public/com/davidsoergel/runutils/0.91/runutils-0.91.jar (40 KB at 40.0 KB/sec)
Downloading: http://dev.davidsoergel.com/nexus/content/groups/public/junit/junit/3.8.1/junit-3.8.1.jar
Downloaded: http://dev.davidsoergel.com/nexus/content/groups/public/org/testng/testng/5.14.10/testng-5.14.10.jar (559 KB at 1734.8 KB/sec)
Downloaded: http://dev.davidsoergel.com/nexus/content/groups/public/junit/junit/3.8.1/junit-3.8.1.jar (119 KB at 382.6 KB/sec)
Downloading: http://dev.davidsoergel.com/nexus/content/groups/public/org/beanshell/bsh/2.0b4/bsh-2.0b4.jar
Downloading: http://dev.davidsoergel.com/nexus/content/groups/public/com/beust/jcommander/1.12/jcommander-1.12.jar
Downloaded: http://dev.davidsoergel.com/nexus/content/groups/public/commons-collections/commons-collections/3.2/commons-collections-3.2.jar (558 KB at 1645.6 KB/sec)
Downloading: http://dev.davidsoergel.com/nexus/content/groups/public/org/yaml/snakeyaml/1.6/snakeyaml-1.6.jar
Downloaded: http://dev.davidsoergel.com/nexus/content/groups/public/com/davidsoergel/stats/0.93/stats-0.93.jar (57 KB at 88.2 KB/sec)
Downloading: http://dev.davidsoergel.com/nexus/content/groups/public/org/slf4j/slf4j-log4j12/1.6.4/slf4j-log4j12-1.6.4.jar
Downloaded: http://dev.davidsoergel.com/nexus/content/groups/public/org/slf4j/slf4j-log4j12/1.6.4/slf4j-log4j12-1.6.4.jar (10 KB at 30.2 KB/sec)
Downloading: http://dev.davidsoergel.com/nexus/content/groups/public/org/slf4j/slf4j-api/1.6.4/slf4j-api-1.6.4.jar
Downloaded: http://dev.davidsoergel.com/nexus/content/groups/public/com/beust/jcommander/1.12/jcommander-1.12.jar (31 KB at 80.6 KB/sec)
Downloading: http://dev.davidsoergel.com/nexus/content/groups/public/log4j/log4j/1.2.16/log4j-1.2.16.jar
Downloaded: http://dev.davidsoergel.com/nexus/content/groups/public/org/beanshell/bsh/2.0b4/bsh-2.0b4.jar (276 KB at 648.8 KB/sec)
Downloading: http://dev.davidsoergel.com/nexus/content/groups/public/com/intellij/annotations/7.0.3/annotations-7.0.3.jar
Downloaded: http://dev.davidsoergel.com/nexus/content/groups/public/org/yaml/snakeyaml/1.6/snakeyaml-1.6.jar (227 KB at 534.6 KB/sec)
Downloaded: http://dev.davidsoergel.com/nexus/content/groups/public/com/intellij/annotations/7.0.3/annotations-7.0.3.jar (6 KB at 3.2 KB/sec)
Downloaded: http://dev.davidsoergel.com/nexus/content/groups/public/org/slf4j/slf4j-api/1.6.4/slf4j-api-1.6.4.jar (26 KB at 14.2 KB/sec)
Downloaded: http://dev.davidsoergel.com/nexus/content/groups/public/com/martiansoftware/JSAP/2.0a-ds1/JSAP-2.0a-ds1.jar (68 KB at 20.5 KB/sec)
Downloaded: http://dev.davidsoergel.com/nexus/content/groups/public/log4j/log4j/1.2.16/log4j-1.2.16.jar (471 KB at 245.3 KB/sec)
mojoStarted org.apache.maven.plugins:maven-clean-plugin:2.4.1(default-clean)
[INFO] 
[INFO] --- maven-clean-plugin:2.4.1:clean (default-clean) @ jlibsvm ---
Downloading: http://dev.davidsoergel.com/nexus/content/groups/public/org/apache/maven/maven-plugin-api/2.0.6/maven-plugin-api-2.0.6.pom
Downloaded: http://dev.davidsoergel.com/nexus/content/groups/public/org/apache/maven/maven-plugin-api/2.0.6/maven-plugin-api-2.0.6.pom (2 KB at 10.1 KB/sec)
Downloading: http://dev.davidsoergel.com/nexus/content/groups/public/org/apache/maven/maven/2.0.6/maven-2.0.6.pom
Downloaded: http://dev.davidsoergel.com/nexus/content/groups/public/org/apache/maven/maven/2.0.6/maven-2.0.6.pom (9 KB at 87.5 KB/sec)
Downloading: http://dev.davidsoergel.com/nexus/content/groups/public/org/apache/maven/maven-parent/5/maven-parent-5.pom
Downloaded: http://dev.davidsoergel.com/nexus/content/groups/public/org/apache/maven/maven-parent/5/maven-parent-5.pom (15 KB at 85.5 KB/sec)
Downloading: http://dev.davidsoergel.com/nexus/content/groups/public/org/codehaus/plexus/plexus-utils/2.0.5/plexus-utils-2.0.5.pom
Downloaded: http://dev.davidsoergel.com/nexus/content/groups/public/org/codehaus/plexus/plexus-utils/2.0.5/plexus-utils-2.0.5.pom (4 KB at 31.9 KB/sec)
Downloading: http://dev.davidsoergel.com/nexus/content/groups/public/org/codehaus/plexus/plexus/2.0.6/plexus-2.0.6.pom
Downloaded: http://dev.davidsoergel.com/nexus/content/groups/public/org/codehaus/plexus/plexus/2.0.6/plexus-2.0.6.pom (17 KB at 94.6 KB/sec)
Downloading: http://dev.davidsoergel.com/nexus/content/groups/public/org/codehaus/plexus/plexus-utils/2.0.5/plexus-utils-2.0.5.jar
Downloaded: http://dev.davidsoergel.com/nexus/content/groups/public/org/codehaus/plexus/plexus-utils/2.0.5/plexus-utils-2.0.5.jar (218 KB at 2758.7 KB/sec)
mojoSucceeded org.apache.maven.plugins:maven-clean-plugin:2.4.1(default-clean)
Downloading: http://dev.davidsoergel.com/nexus/content/groups/public/net/sourceforge/cobertura/cobertura/1.9.4.1/cobertura-1.9.4.1.pom
Downloaded: http://dev.davidsoergel.com/nexus/content/groups/public/net/sourceforge/cobertura/cobertura/1.9.4.1/cobertura-1.9.4.1.pom (2 KB at 10.9 KB/sec)
Downloading: http://dev.davidsoergel.com/nexus/content/groups/public/oro/oro/2.0.8/oro-2.0.8.pom
Downloaded: http://dev.davidsoergel.com/nexus/content/groups/public/oro/oro/2.0.8/oro-2.0.8.pom (140 B at 0.9 KB/sec)
Downloading: http://dev.davidsoergel.com/nexus/content/groups/public/asm/asm/3.0/asm-3.0.pom
Downloaded: http://dev.davidsoergel.com/nexus/content/groups/public/asm/asm/3.0/asm-3.0.pom (360 B at 1.8 KB/sec)
Downloading: http://dev.davidsoergel.com/nexus/content/groups/public/asm/asm-parent/3.0/asm-parent-3.0.pom
Downloaded: http://dev.davidsoergel.com/nexus/content/groups/public/asm/asm-parent/3.0/asm-parent-3.0.pom (3 KB at 12.5 KB/sec)
Downloading: http://dev.davidsoergel.com/nexus/content/groups/public/asm/asm-tree/3.0/asm-tree-3.0.pom
Downloaded: http://dev.davidsoergel.com/nexus/content/groups/public/asm/asm-tree/3.0/asm-tree-3.0.pom (499 B at 6.2 KB/sec)
Downloading: http://dev.davidsoergel.com/nexus/content/groups/public/log4j/log4j/1.2.9/log4j-1.2.9.pom
Downloaded: http://dev.davidsoergel.com/nexus/content/groups/public/log4j/log4j/1.2.9/log4j-1.2.9.pom (144 B at 0.6 KB/sec)
Downloading: http://dev.davidsoergel.com/nexus/content/groups/public/org/apache/ant/ant/1.7.0/ant-1.7.0.pom
Downloaded: http://dev.davidsoergel.com/nexus/content/groups/public/org/apache/ant/ant/1.7.0/ant-1.7.0.pom (10 KB at 30.4 KB/sec)
Downloading: http://dev.davidsoergel.com/nexus/content/groups/public/org/apache/ant/ant-parent/1.7.0/ant-parent-1.7.0.pom
Downloaded: http://dev.davidsoergel.com/nexus/content/groups/public/org/apache/ant/ant-parent/1.7.0/ant-parent-1.7.0.pom (5 KB at 14.9 KB/sec)
Downloading: http://dev.davidsoergel.com/nexus/content/groups/public/org/apache/ant/ant-launcher/1.7.0/ant-launcher-1.7.0.pom
Downloaded: http://dev.davidsoergel.com/nexus/content/groups/public/org/apache/ant/ant-launcher/1.7.0/ant-launcher-1.7.0.pom (3 KB at 12.4 KB/sec)
Downloading: http://dev.davidsoergel.com/nexus/content/groups/public/net/sourceforge/cobertura/cobertura-runtime/1.9.4.1/cobertura-runtime-1.9.4.1.pom
Downloaded: http://dev.davidsoergel.com/nexus/content/groups/public/net/sourceforge/cobertura/cobertura-runtime/1.9.4.1/cobertura-runtime-1.9.4.1.pom (2 KB at 10.7 KB/sec)
Downloading: http://dev.davidsoergel.com/nexus/content/groups/public/urbanophile/java-getopt/1.0.9/java-getopt-1.0.9.pom
Downloaded: http://dev.davidsoergel.com/nexus/content/groups/public/urbanophile/java-getopt/1.0.9/java-getopt-1.0.9.pom (157 B at 1.2 KB/sec)
Downloading: http://dev.davidsoergel.com/nexus/content/groups/public/org/apache/maven/maven-core/2.0.8/maven-core-2.0.8.pom
Downloaded: http://dev.davidsoergel.com/nexus/content/groups/public/org/apache/maven/maven-core/2.0.8/maven-core-2.0.8.pom (7 KB at 56.4 KB/sec)
Downloading: http://dev.davidsoergel.com/nexus/content/groups/public/org/apache/maven/maven/2.0.8/maven-2.0.8.pom
Downloaded: http://dev.davidsoergel.com/nexus/content/groups/public/org/apache/maven/maven/2.0.8/maven-2.0.8.pom (12 KB at 92.3 KB/sec)
Downloading: http://dev.davidsoergel.com/nexus/content/groups/public/org/apache/maven/maven-parent/6/maven-parent-6.pom
Downloaded: http://dev.davidsoergel.com/nexus/content/groups/public/org/apache/maven/maven-parent/6/maven-parent-6.pom (20 KB at 151.8 KB/sec)
Downloading: http://dev.davidsoergel.com/nexus/content/groups/public/org/apache/maven/maven-settings/2.0.8/maven-settings-2.0.8.pom
Downloaded: http://dev.davidsoergel.com/nexus/content/groups/public/org/apache/maven/maven-settings/2.0.8/maven-settings-2.0.8.pom (3 KB at 11.8 KB/sec)
Downloading: http://dev.davidsoergel.com/nexus/content/groups/public/org/apache/maven/maven-model/2.0.8/maven-model-2.0.8.pom
mojoStarted org.codehaus.mojo:cobertura-maven-plugin:2.5.1(clean)
[INFO] 
[INFO] --- cobertura-maven-plugin:2.5.1:clean (clean) @ jlibsvm ---
Downloaded: http://dev.davidsoergel.com/nexus/content/groups/public/org/apache/maven/maven-model/2.0.8/maven-model-2.0.8.pom (4 KB at 1.6 KB/sec)
Downloading: http://dev.davidsoergel.com/nexus/content/groups/public/org/codehaus/plexus/plexus-utils/1.4.6/plexus-utils-1.4.6.pom
Downloaded: http://dev.davidsoergel.com/nexus/content/groups/public/org/codehaus/plexus/plexus-utils/1.4.6/plexus-utils-1.4.6.pom (3 KB at 17.0 KB/sec)
Downloading: http://dev.davidsoergel.com/nexus/content/groups/public/org/codehaus/plexus/plexus-container-default/1.0-alpha-9-stable-1/plexus-container-default-1.0-alpha-9-stable-1.pom
Downloaded: http://dev.davidsoergel.com/nexus/content/groups/public/org/codehaus/plexus/plexus-container-default/1.0-alpha-9-stable-1/plexus-container-default-1.0-alpha-9-stable-1.pom (4 KB at 32.4 KB/sec)
Downloading: http://dev.davidsoergel.com/nexus/content/groups/public/org/codehaus/plexus/plexus-containers/1.0.3/plexus-containers-1.0.3.pom
Downloaded: http://dev.davidsoergel.com/nexus/content/groups/public/org/codehaus/plexus/plexus-containers/1.0.3/plexus-containers-1.0.3.pom (492 B at 0.7 KB/sec)
Downloading: http://dev.davidsoergel.com/nexus/content/groups/public/org/codehaus/plexus/plexus/1.0.4/plexus-1.0.4.pom
Downloaded: http://dev.davidsoergel.com/nexus/content/groups/public/org/codehaus/plexus/plexus/1.0.4/plexus-1.0.4.pom (6 KB at 56.0 KB/sec)
Downloading: http://dev.davidsoergel.com/nexus/content/groups/public/junit/junit/3.8.2/junit-3.8.2.pom
Downloaded: http://dev.davidsoergel.com/nexus/content/groups/public/junit/junit/3.8.2/junit-3.8.2.pom (747 B at 4.4 KB/sec)
Downloading: http://dev.davidsoergel.com/nexus/content/groups/public/classworlds/classworlds/1.1-alpha-2/classworlds-1.1-alpha-2.pom
Downloaded: http://dev.davidsoergel.com/nexus/content/groups/public/classworlds/classworlds/1.1-alpha-2/classworlds-1.1-alpha-2.pom (4 KB at 19.7 KB/sec)
Downloading: http://dev.davidsoergel.com/nexus/content/groups/public/org/apache/maven/maven-plugin-parameter-documenter/2.0.8/maven-plugin-parameter-documenter-2.0.8.pom
Downloaded: http://dev.davidsoergel.com/nexus/content/groups/public/org/apache/maven/maven-plugin-parameter-documenter/2.0.8/maven-plugin-parameter-documenter-2.0.8.pom (2 KB at 13.0 KB/sec)
Downloading: http://dev.davidsoergel.com/nexus/content/groups/public/org/apache/maven/reporting/maven-reporting-api/2.0.8/maven-reporting-api-2.0.8.pom
Downloaded: http://dev.davidsoergel.com/nexus/content/groups/public/org/apache/maven/reporting/maven-reporting-api/2.0.8/maven-reporting-api-2.0.8.pom (2 KB at 7.2 KB/sec)
Downloading: http://dev.davidsoergel.com/nexus/content/groups/public/org/apache/maven/reporting/maven-reporting/2.0.8/maven-reporting-2.0.8.pom
Downloaded: http://dev.davidsoergel.com/nexus/content/groups/public/org/apache/maven/reporting/maven-reporting/2.0.8/maven-reporting-2.0.8.pom (2 KB at 6.7 KB/sec)
Downloading: http://dev.davidsoergel.com/nexus/content/groups/public/org/apache/maven/doxia/doxia-sink-api/1.0-alpha-9/doxia-sink-api-1.0-alpha-9.pom
Downloaded: http://dev.davidsoergel.com/nexus/content/groups/public/org/apache/maven/doxia/doxia-sink-api/1.0-alpha-9/doxia-sink-api-1.0-alpha-9.pom (2 KB at 4.7 KB/sec)
Downloading: http://dev.davidsoergel.com/nexus/content/groups/public/org/apache/maven/doxia/doxia/1.0-alpha-9/doxia-1.0-alpha-9.pom
Downloaded: http://dev.davidsoergel.com/nexus/content/groups/public/org/apache/maven/doxia/doxia/1.0-alpha-9/doxia-1.0-alpha-9.pom (9 KB at 28.8 KB/sec)
Downloading: http://dev.davidsoergel.com/nexus/content/groups/public/org/apache/maven/maven-profile/2.0.8/maven-profile-2.0.8.pom
Downloaded: http://dev.davidsoergel.com/nexus/content/groups/public/org/apache/maven/maven-profile/2.0.8/maven-profile-2.0.8.pom (2 KB at 9.8 KB/sec)
Downloading: http://dev.davidsoergel.com/nexus/content/groups/public/org/apache/maven/maven-artifact/2.0.8/maven-artifact-2.0.8.pom
Downloaded: http://dev.davidsoergel.com/nexus/content/groups/public/org/apache/maven/maven-artifact/2.0.8/maven-artifact-2.0.8.pom (2 KB at 5.3 KB/sec)
Downloading: http://dev.davidsoergel.com/nexus/content/groups/public/org/apache/maven/maven-repository-metadata/2.0.8/maven-repository-metadata-2.0.8.pom
Downloaded: http://dev.davidsoergel.com/nexus/content/groups/public/org/apache/maven/maven-repository-metadata/2.0.8/maven-repository-metadata-2.0.8.pom (2 KB at 6.4 KB/sec)
Downloading: http://dev.davidsoergel.com/nexus/content/groups/public/org/apache/maven/maven-error-diagnostics/2.0.8/maven-error-diagnostics-2.0.8.pom
Downloaded: http://dev.davidsoergel.com/nexus/content/groups/public/org/apache/maven/maven-error-diagnostics/2.0.8/maven-error-diagnostics-2.0.8.pom (2 KB at 5.6 KB/sec)
Downloading: http://dev.davidsoergel.com/nexus/content/groups/public/org/apache/maven/maven-project/2.0.8/maven-project-2.0.8.pom
Downloaded: http://dev.davidsoergel.com/nexus/content/groups/public/org/apache/maven/maven-project/2.0.8/maven-project-2.0.8.pom (3 KB at 13.0 KB/sec)
Downloading: http://dev.davidsoergel.com/nexus/content/groups/public/org/apache/maven/maven-artifact-manager/2.0.8/maven-artifact-manager-2.0.8.pom
Downloaded: http://dev.davidsoergel.com/nexus/content/groups/public/org/apache/maven/maven-artifact-manager/2.0.8/maven-artifact-manager-2.0.8.pom (3 KB at 10.8 KB/sec)
Downloading: http://dev.davidsoergel.com/nexus/content/groups/public/org/apache/maven/maven-plugin-registry/2.0.8/maven-plugin-registry-2.0.8.pom
Downloaded: http://dev.davidsoergel.com/nexus/content/groups/public/org/apache/maven/maven-plugin-registry/2.0.8/maven-plugin-registry-2.0.8.pom (2 KB at 6.8 KB/sec)
Downloading: http://dev.davidsoergel.com/nexus/content/groups/public/commons-cli/commons-cli/1.0/commons-cli-1.0.pom
Downloaded: http://dev.davidsoergel.com/nexus/content/groups/public/commons-cli/commons-cli/1.0/commons-cli-1.0.pom (3 KB at 6.5 KB/sec)
Downloading: http://dev.davidsoergel.com/nexus/content/groups/public/org/apache/maven/maven-plugin-api/2.0/maven-plugin-api-2.0.pom
Downloaded: http://dev.davidsoergel.com/nexus/content/groups/public/org/apache/maven/maven-plugin-api/2.0/maven-plugin-api-2.0.pom (601 B at 5.1 KB/sec)
Downloading: http://dev.davidsoergel.com/nexus/content/groups/public/org/apache/maven/maven/2.0/maven-2.0.pom
Downloaded: http://dev.davidsoergel.com/nexus/content/groups/public/org/apache/maven/maven/2.0/maven-2.0.pom (9 KB at 39.1 KB/sec)
Downloading: http://dev.davidsoergel.com/nexus/content/groups/public/org/apache/maven/maven-plugin-descriptor/2.0.8/maven-plugin-descriptor-2.0.8.pom
Downloaded: http://dev.davidsoergel.com/nexus/content/groups/public/org/apache/maven/maven-plugin-descriptor/2.0.8/maven-plugin-descriptor-2.0.8.pom (3 KB at 7.3 KB/sec)
Downloading: http://dev.davidsoergel.com/nexus/content/groups/public/org/codehaus/plexus/plexus-interactivity-api/1.0-alpha-4/plexus-interactivity-api-1.0-alpha-4.pom
Downloaded: http://dev.davidsoergel.com/nexus/content/groups/public/org/codehaus/plexus/plexus-interactivity-api/1.0-alpha-4/plexus-interactivity-api-1.0-alpha-4.pom (7 KB at 40.0 KB/sec)
Downloading: http://dev.davidsoergel.com/nexus/content/groups/public/org/apache/maven/maven-monitor/2.0.8/maven-monitor-2.0.8.pom
Downloaded: http://dev.davidsoergel.com/nexus/content/groups/public/org/apache/maven/maven-monitor/2.0.8/maven-monitor-2.0.8.pom (2 KB at 4.5 KB/sec)
Downloading: http://dev.davidsoergel.com/nexus/content/groups/public/classworlds/classworlds/1.1/classworlds-1.1.pom
Downloaded: http://dev.davidsoergel.com/nexus/content/groups/public/classworlds/classworlds/1.1/classworlds-1.1.pom (4 KB at 15.8 KB/sec)
Downloading: http://dev.davidsoergel.com/nexus/content/groups/public/org/apache/maven/maven-plugin-api/2.0.8/maven-plugin-api-2.0.8.pom
Downloaded: http://dev.davidsoergel.com/nexus/content/groups/public/org/apache/maven/maven-plugin-api/2.0.8/maven-plugin-api-2.0.8.pom (2 KB at 7.6 KB/sec)
Downloading: http://dev.davidsoergel.com/nexus/content/groups/public/org/apache/maven/reporting/maven-reporting-impl/2.0.4.2/maven-reporting-impl-2.0.4.2.pom
Downloaded: http://dev.davidsoergel.com/nexus/content/groups/public/org/apache/maven/reporting/maven-reporting-impl/2.0.4.2/maven-reporting-impl-2.0.4.2.pom (6 KB at 19.5 KB/sec)
Downloading: http://dev.davidsoergel.com/nexus/content/groups/public/org/apache/maven/shared/maven-shared-components/11/maven-shared-components-11.pom
Downloaded: http://dev.davidsoergel.com/nexus/content/groups/public/org/apache/maven/shared/maven-shared-components/11/maven-shared-components-11.pom (9 KB at 33.1 KB/sec)
Downloading: http://dev.davidsoergel.com/nexus/content/groups/public/org/apache/maven/maven-parent/11/maven-parent-11.pom
Downloaded: http://dev.davidsoergel.com/nexus/content/groups/public/org/apache/maven/maven-parent/11/maven-parent-11.pom (32 KB at 116.8 KB/sec)
Downloading: http://dev.davidsoergel.com/nexus/content/groups/public/org/apache/apache/5/apache-5.pom
Downloaded: http://dev.davidsoergel.com/nexus/content/groups/public/org/apache/apache/5/apache-5.pom (5 KB at 7.4 KB/sec)
Downloading: http://dev.davidsoergel.com/nexus/content/groups/public/org/apache/maven/maven-project/2.0.4/maven-project-2.0.4.pom
Downloaded: http://dev.davidsoergel.com/nexus/content/groups/public/org/apache/maven/maven-project/2.0.4/maven-project-2.0.4.pom (2 KB at 18.0 KB/sec)
Downloading: http://dev.davidsoergel.com/nexus/content/groups/public/org/apache/maven/maven/2.0.4/maven-2.0.4.pom
Downloaded: http://dev.davidsoergel.com/nexus/content/groups/public/org/apache/maven/maven/2.0.4/maven-2.0.4.pom (12 KB at 99.3 KB/sec)
Downloading: http://dev.davidsoergel.com/nexus/content/groups/public/org/apache/maven/maven-settings/2.0.4/maven-settings-2.0.4.pom
Downloaded: http://dev.davidsoergel.com/nexus/content/groups/public/org/apache/maven/maven-settings/2.0.4/maven-settings-2.0.4.pom (2 KB at 5.6 KB/sec)
Downloading: http://dev.davidsoergel.com/nexus/content/groups/public/org/apache/maven/maven-model/2.0.4/maven-model-2.0.4.pom
Downloaded: http://dev.davidsoergel.com/nexus/content/groups/public/org/apache/maven/maven-model/2.0.4/maven-model-2.0.4.pom (3 KB at 18.9 KB/sec)
Downloading: http://dev.davidsoergel.com/nexus/content/groups/public/org/codehaus/plexus/plexus-utils/1.1/plexus-utils-1.1.pom
Downloaded: http://dev.davidsoergel.com/nexus/content/groups/public/org/codehaus/plexus/plexus-utils/1.1/plexus-utils-1.1.pom (767 B at 6.5 KB/sec)
Downloading: http://dev.davidsoergel.com/nexus/content/groups/public/org/codehaus/plexus/plexus-container-default/1.0-alpha-9/plexus-container-default-1.0-alpha-9.pom
Downloaded: http://dev.davidsoergel.com/nexus/content/groups/public/org/codehaus/plexus/plexus-container-default/1.0-alpha-9/plexus-container-default-1.0-alpha-9.pom (2 KB at 0.9 KB/sec)
Downloading: http://dev.davidsoergel.com/nexus/content/groups/public/org/apache/maven/maven-profile/2.0.4/maven-profile-2.0.4.pom
Downloaded: http://dev.davidsoergel.com/nexus/content/groups/public/org/apache/maven/maven-profile/2.0.4/maven-profile-2.0.4.pom (2 KB at 47.9 KB/sec)
Downloading: http://dev.davidsoergel.com/nexus/content/groups/public/org/apache/maven/maven-artifact-manager/2.0.4/maven-artifact-manager-2.0.4.pom
Downloaded: http://dev.davidsoergel.com/nexus/content/groups/public/org/apache/maven/maven-artifact-manager/2.0.4/maven-artifact-manager-2.0.4.pom (2 KB at 7.4 KB/sec)
Downloading: http://dev.davidsoergel.com/nexus/content/groups/public/org/apache/maven/maven-repository-metadata/2.0.4/maven-repository-metadata-2.0.4.pom
Downloaded: http://dev.davidsoergel.com/nexus/content/groups/public/org/apache/maven/maven-repository-metadata/2.0.4/maven-repository-metadata-2.0.4.pom (2 KB at 9.9 KB/sec)
Downloading: http://dev.davidsoergel.com/nexus/content/groups/public/org/apache/maven/maven-artifact/2.0.4/maven-artifact-2.0.4.pom
Downloaded: http://dev.davidsoergel.com/nexus/content/groups/public/org/apache/maven/maven-artifact/2.0.4/maven-artifact-2.0.4.pom (765 B at 5.9 KB/sec)
Downloading: http://dev.davidsoergel.com/nexus/content/groups/public/commons-validator/commons-validator/1.2.0/commons-validator-1.2.0.pom
Downloaded: http://dev.davidsoergel.com/nexus/content/groups/public/commons-validator/commons-validator/1.2.0/commons-validator-1.2.0.pom (9 KB at 87.0 KB/sec)
Downloading: http://dev.davidsoergel.com/nexus/content/groups/public/commons-beanutils/commons-beanutils/1.7.0/commons-beanutils-1.7.0.pom
Downloaded: http://dev.davidsoergel.com/nexus/content/groups/public/commons-beanutils/commons-beanutils/1.7.0/commons-beanutils-1.7.0.pom (357 B at 2.4 KB/sec)
Downloading: http://dev.davidsoergel.com/nexus/content/groups/public/commons-digester/commons-digester/1.6/commons-digester-1.6.pom
Downloaded: http://dev.davidsoergel.com/nexus/content/groups/public/commons-digester/commons-digester/1.6/commons-digester-1.6.pom (974 B at 5.1 KB/sec)
Downloading: http://dev.davidsoergel.com/nexus/content/groups/public/commons-beanutils/commons-beanutils/1.6/commons-beanutils-1.6.pom
Downloaded: http://dev.davidsoergel.com/nexus/content/groups/public/commons-beanutils/commons-beanutils/1.6/commons-beanutils-1.6.pom (3 KB at 15.1 KB/sec)
Downloading: http://dev.davidsoergel.com/nexus/content/groups/public/commons-logging/commons-logging/1.0/commons-logging-1.0.pom
Downloaded: http://dev.davidsoergel.com/nexus/content/groups/public/commons-logging/commons-logging/1.0/commons-logging-1.0.pom (163 B at 0.5 KB/sec)
Downloading: http://dev.davidsoergel.com/nexus/content/groups/public/commons-collections/commons-collections/2.0/commons-collections-2.0.pom
Downloaded: http://dev.davidsoergel.com/nexus/content/groups/public/commons-collections/commons-collections/2.0/commons-collections-2.0.pom (171 B at 1.0 KB/sec)
Downloading: http://dev.davidsoergel.com/nexus/content/groups/public/commons-collections/commons-collections/2.1/commons-collections-2.1.pom
Downloaded: http://dev.davidsoergel.com/nexus/content/groups/public/commons-collections/commons-collections/2.1/commons-collections-2.1.pom (4 KB at 21.0 KB/sec)
Downloading: http://dev.davidsoergel.com/nexus/content/groups/public/xml-apis/xml-apis/1.0.b2/xml-apis-1.0.b2.pom
Downloaded: http://dev.davidsoergel.com/nexus/content/groups/public/xml-apis/xml-apis/1.0.b2/xml-apis-1.0.b2.pom (3 KB at 9.5 KB/sec)
Downloading: http://dev.davidsoergel.com/nexus/content/groups/public/xml-apis/xml-apis/2.0.2/xml-apis-2.0.2.pom
Downloaded: http://dev.davidsoergel.com/nexus/content/groups/public/xml-apis/xml-apis/2.0.2/xml-apis-2.0.2.pom (346 B at 1.6 KB/sec)
Downloading: http://dev.davidsoergel.com/nexus/content/groups/public/org/apache/maven/doxia/doxia-core/1.0/doxia-core-1.0.pom
Downloaded: http://dev.davidsoergel.com/nexus/content/groups/public/org/apache/maven/doxia/doxia-core/1.0/doxia-core-1.0.pom (3 KB at 14.5 KB/sec)
Downloading: http://dev.davidsoergel.com/nexus/content/groups/public/org/apache/maven/doxia/doxia/1.0/doxia-1.0.pom
Downloaded: http://dev.davidsoergel.com/nexus/content/groups/public/org/apache/maven/doxia/doxia/1.0/doxia-1.0.pom (10 KB at 52.9 KB/sec)
Downloading: http://dev.davidsoergel.com/nexus/content/groups/public/org/apache/maven/maven-parent/10/maven-parent-10.pom
Downloaded: http://dev.davidsoergel.com/nexus/content/groups/public/org/apache/maven/maven-parent/10/maven-parent-10.pom (31 KB at 241.4 KB/sec)
Downloading: http://dev.davidsoergel.com/nexus/content/groups/public/org/apache/maven/doxia/doxia-sink-api/1.0/doxia-sink-api-1.0.pom
Downloaded: http://dev.davidsoergel.com/nexus/content/groups/public/org/apache/maven/doxia/doxia-sink-api/1.0/doxia-sink-api-1.0.pom (2 KB at 10.6 KB/sec)
Downloading: http://dev.davidsoergel.com/nexus/content/groups/public/org/codehaus/plexus/plexus-utils/1.5.7/plexus-utils-1.5.7.pom
Downloaded: http://dev.davidsoergel.com/nexus/content/groups/public/org/codehaus/plexus/plexus-utils/1.5.7/plexus-utils-1.5.7.pom (8 KB at 52.5 KB/sec)
Downloading: http://dev.davidsoergel.com/nexus/content/groups/public/org/codehaus/plexus/plexus/2.0.2/plexus-2.0.2.pom
Downloaded: http://dev.davidsoergel.com/nexus/content/groups/public/org/codehaus/plexus/plexus/2.0.2/plexus-2.0.2.pom (12 KB at 141.7 KB/sec)
Downloading: http://dev.davidsoergel.com/nexus/content/groups/public/org/codehaus/plexus/plexus-container-default/1.0-alpha-30/plexus-container-default-1.0-alpha-30.pom
Downloaded: http://dev.davidsoergel.com/nexus/content/groups/public/org/codehaus/plexus/plexus-container-default/1.0-alpha-30/plexus-container-default-1.0-alpha-30.pom (4 KB at 21.6 KB/sec)
Downloading: http://dev.davidsoergel.com/nexus/content/groups/public/org/codehaus/plexus/plexus-containers/1.0-alpha-30/plexus-containers-1.0-alpha-30.pom
Downloaded: http://dev.davidsoergel.com/nexus/content/groups/public/org/codehaus/plexus/plexus-containers/1.0-alpha-30/plexus-containers-1.0-alpha-30.pom (2 KB at 14.1 KB/sec)
Downloading: http://dev.davidsoergel.com/nexus/content/groups/public/org/codehaus/plexus/plexus-utils/1.4.5/plexus-utils-1.4.5.pom
Downloaded: http://dev.davidsoergel.com/nexus/content/groups/public/org/codehaus/plexus/plexus-utils/1.4.5/plexus-utils-1.4.5.pom (3 KB at 8.5 KB/sec)
Downloading: http://dev.davidsoergel.com/nexus/content/groups/public/org/codehaus/plexus/plexus-classworlds/1.2-alpha-9/plexus-classworlds-1.2-alpha-9.pom
Downloaded: http://dev.davidsoergel.com/nexus/content/groups/public/org/codehaus/plexus/plexus-classworlds/1.2-alpha-9/plexus-classworlds-1.2-alpha-9.pom (4 KB at 17.5 KB/sec)
Downloading: http://dev.davidsoergel.com/nexus/content/groups/public/org/apache/maven/reporting/maven-reporting-api/2.0.4/maven-reporting-api-2.0.4.pom
Downloaded: http://dev.davidsoergel.com/nexus/content/groups/public/org/apache/maven/reporting/maven-reporting-api/2.0.4/maven-reporting-api-2.0.4.pom (902 B at 6.0 KB/sec)
Downloading: http://dev.davidsoergel.com/nexus/content/groups/public/org/apache/maven/reporting/maven-reporting/2.0.4/maven-reporting-2.0.4.pom
Downloaded: http://dev.davidsoergel.com/nexus/content/groups/public/org/apache/maven/reporting/maven-reporting/2.0.4/maven-reporting-2.0.4.pom (700 B at 12.2 KB/sec)
Downloading: http://dev.davidsoergel.com/nexus/content/groups/public/org/apache/maven/doxia/doxia-sink-api/1.0-alpha-7/doxia-sink-api-1.0-alpha-7.pom
Downloaded: http://dev.davidsoergel.com/nexus/content/groups/public/org/apache/maven/doxia/doxia-sink-api/1.0-alpha-7/doxia-sink-api-1.0-alpha-7.pom (424 B at 2.4 KB/sec)
Downloading: http://dev.davidsoergel.com/nexus/content/groups/public/org/apache/maven/doxia/doxia/1.0-alpha-7/doxia-1.0-alpha-7.pom
Downloaded: http://dev.davidsoergel.com/nexus/content/groups/public/org/apache/maven/doxia/doxia/1.0-alpha-7/doxia-1.0-alpha-7.pom (4 KB at 12.6 KB/sec)
Downloading: http://dev.davidsoergel.com/nexus/content/groups/public/org/apache/maven/doxia/doxia-site-renderer/1.0/doxia-site-renderer-1.0.pom
Downloaded: http://dev.davidsoergel.com/nexus/content/groups/public/org/apache/maven/doxia/doxia-site-renderer/1.0/doxia-site-renderer-1.0.pom (5 KB at 37.6 KB/sec)
Downloading: http://dev.davidsoergel.com/nexus/content/groups/public/org/apache/maven/doxia/doxia-sitetools/1.0/doxia-sitetools-1.0.pom
Downloaded: http://dev.davidsoergel.com/nexus/content/groups/public/org/apache/maven/doxia/doxia-sitetools/1.0/doxia-sitetools-1.0.pom (10 KB at 63.7 KB/sec)
Downloading: http://dev.davidsoergel.com/nexus/content/groups/public/org/codehaus/plexus/plexus-i18n/1.0-beta-7/plexus-i18n-1.0-beta-7.pom
Downloaded: http://dev.davidsoergel.com/nexus/content/groups/public/org/codehaus/plexus/plexus-i18n/1.0-beta-7/plexus-i18n-1.0-beta-7.pom (2 KB at 1.6 KB/sec)
Downloading: http://dev.davidsoergel.com/nexus/content/groups/public/org/codehaus/plexus/plexus-components/1.1.12/plexus-components-1.1.12.pom
Downloaded: http://dev.davidsoergel.com/nexus/content/groups/public/org/codehaus/plexus/plexus-components/1.1.12/plexus-components-1.1.12.pom (3 KB at 29.9 KB/sec)
Downloading: http://dev.davidsoergel.com/nexus/content/groups/public/org/codehaus/plexus/plexus-utils/1.4.1/plexus-utils-1.4.1.pom
Downloaded: http://dev.davidsoergel.com/nexus/content/groups/public/org/codehaus/plexus/plexus-utils/1.4.1/plexus-utils-1.4.1.pom (2 KB at 28.7 KB/sec)
Downloading: http://dev.davidsoergel.com/nexus/content/groups/public/org/codehaus/plexus/plexus-velocity/1.1.7/plexus-velocity-1.1.7.pom
Downloaded: http://dev.davidsoergel.com/nexus/content/groups/public/org/codehaus/plexus/plexus-velocity/1.1.7/plexus-velocity-1.1.7.pom (2 KB at 28.5 KB/sec)
Downloading: http://dev.davidsoergel.com/nexus/content/groups/public/org/codehaus/plexus/plexus-container-default/1.0-alpha-20/plexus-container-default-1.0-alpha-20.pom
Downloaded: http://dev.davidsoergel.com/nexus/content/groups/public/org/codehaus/plexus/plexus-container-default/1.0-alpha-20/plexus-container-default-1.0-alpha-20.pom (3 KB at 21.3 KB/sec)
Downloading: http://dev.davidsoergel.com/nexus/content/groups/public/org/codehaus/plexus/plexus-containers/1.0-alpha-20/plexus-containers-1.0-alpha-20.pom
Downloaded: http://dev.davidsoergel.com/nexus/content/groups/public/org/codehaus/plexus/plexus-containers/1.0-alpha-20/plexus-containers-1.0-alpha-20.pom (2 KB at 15.3 KB/sec)
Downloading: http://dev.davidsoergel.com/nexus/content/groups/public/org/codehaus/plexus/plexus-utils/1.3/plexus-utils-1.3.pom
Downloaded: http://dev.davidsoergel.com/nexus/content/groups/public/org/codehaus/plexus/plexus-utils/1.3/plexus-utils-1.3.pom (2 KB at 3.2 KB/sec)
Downloading: http://dev.davidsoergel.com/nexus/content/groups/public/org/codehaus/plexus/plexus/1.0.8/plexus-1.0.8.pom
Downloaded: http://dev.davidsoergel.com/nexus/content/groups/public/org/codehaus/plexus/plexus/1.0.8/plexus-1.0.8.pom (8 KB at 105.4 KB/sec)
Downloading: http://dev.davidsoergel.com/nexus/content/groups/public/org/codehaus/plexus/plexus-classworlds/1.2-alpha-7/plexus-classworlds-1.2-alpha-7.pom
Downloaded: http://dev.davidsoergel.com/nexus/content/groups/public/org/codehaus/plexus/plexus-classworlds/1.2-alpha-7/plexus-classworlds-1.2-alpha-7.pom (3 KB at 30.1 KB/sec)
Downloading: http://dev.davidsoergel.com/nexus/content/groups/public/org/codehaus/plexus/plexus/1.0.9/plexus-1.0.9.pom
Downloaded: http://dev.davidsoergel.com/nexus/content/groups/public/org/codehaus/plexus/plexus/1.0.9/plexus-1.0.9.pom (8 KB at 26.7 KB/sec)
Downloading: http://dev.davidsoergel.com/nexus/content/groups/public/org/apache/velocity/velocity/1.5/velocity-1.5.pom
Downloaded: http://dev.davidsoergel.com/nexus/content/groups/public/org/apache/velocity/velocity/1.5/velocity-1.5.pom (8 KB at 39.3 KB/sec)
Downloading: http://dev.davidsoergel.com/nexus/content/groups/public/commons-collections/commons-collections/3.1/commons-collections-3.1.pom
Downloaded: http://dev.davidsoergel.com/nexus/content/groups/public/commons-collections/commons-collections/3.1/commons-collections-3.1.pom (6 KB at 27.8 KB/sec)
Downloading: http://dev.davidsoergel.com/nexus/content/groups/public/commons-lang/commons-lang/2.1/commons-lang-2.1.pom
Downloaded: http://dev.davidsoergel.com/nexus/content/groups/public/commons-lang/commons-lang/2.1/commons-lang-2.1.pom (10 KB at 42.2 KB/sec)
Downloading: http://dev.davidsoergel.com/nexus/content/groups/public/org/apache/maven/doxia/doxia-decoration-model/1.0/doxia-decoration-model-1.0.pom
Downloaded: http://dev.davidsoergel.com/nexus/content/groups/public/org/apache/maven/doxia/doxia-decoration-model/1.0/doxia-decoration-model-1.0.pom (4 KB at 44.0 KB/sec)
Downloading: http://dev.davidsoergel.com/nexus/content/groups/public/org/apache/maven/doxia/doxia-module-apt/1.0/doxia-module-apt-1.0.pom
Downloaded: http://dev.davidsoergel.com/nexus/content/groups/public/org/apache/maven/doxia/doxia-module-apt/1.0/doxia-module-apt-1.0.pom (3 KB at 12.5 KB/sec)
Downloading: http://dev.davidsoergel.com/nexus/content/groups/public/org/apache/maven/doxia/doxia-modules/1.0/doxia-modules-1.0.pom
Downloaded: http://dev.davidsoergel.com/nexus/content/groups/public/org/apache/maven/doxia/doxia-modules/1.0/doxia-modules-1.0.pom (3 KB at 12.6 KB/sec)
Downloading: http://dev.davidsoergel.com/nexus/content/groups/public/org/apache/maven/doxia/doxia-module-fml/1.0/doxia-module-fml-1.0.pom
Downloaded: http://dev.davidsoergel.com/nexus/content/groups/public/org/apache/maven/doxia/doxia-module-fml/1.0/doxia-module-fml-1.0.pom (3 KB at 6.2 KB/sec)
Downloading: http://dev.davidsoergel.com/nexus/content/groups/public/org/apache/maven/doxia/doxia-module-xdoc/1.0/doxia-module-xdoc-1.0.pom
Downloaded: http://dev.davidsoergel.com/nexus/content/groups/public/org/apache/maven/doxia/doxia-module-xdoc/1.0/doxia-module-xdoc-1.0.pom (3 KB at 19.2 KB/sec)
Downloading: http://dev.davidsoergel.com/nexus/content/groups/public/org/apache/maven/doxia/doxia-module-xhtml/1.0/doxia-module-xhtml-1.0.pom
Downloaded: http://dev.davidsoergel.com/nexus/content/groups/public/org/apache/maven/doxia/doxia-module-xhtml/1.0/doxia-module-xhtml-1.0.pom (2 KB at 9.3 KB/sec)
Downloading: http://dev.davidsoergel.com/nexus/content/groups/public/commons-lang/commons-lang/2.4/commons-lang-2.4.pom
Downloaded: http://dev.davidsoergel.com/nexus/content/groups/public/commons-lang/commons-lang/2.4/commons-lang-2.4.pom (14 KB at 37.0 KB/sec)
Downloading: http://dev.davidsoergel.com/nexus/content/groups/public/org/apache/commons/commons-parent/9/commons-parent-9.pom
Downloaded: http://dev.davidsoergel.com/nexus/content/groups/public/org/apache/commons/commons-parent/9/commons-parent-9.pom (22 KB at 35.7 KB/sec)
Downloading: http://dev.davidsoergel.com/nexus/content/groups/public/org/codehaus/plexus/plexus-utils/2.0.2/plexus-utils-2.0.2.pom
Downloaded: http://dev.davidsoergel.com/nexus/content/groups/public/org/codehaus/plexus/plexus-utils/2.0.2/plexus-utils-2.0.2.pom (4 KB at 8.2 KB/sec)
Downloading: http://dev.davidsoergel.com/nexus/content/groups/public/org/apache/maven/shared/maven-invoker/2.0.11/maven-invoker-2.0.11.pom
Downloaded: http://dev.davidsoergel.com/nexus/content/groups/public/org/apache/maven/shared/maven-invoker/2.0.11/maven-invoker-2.0.11.pom (5 KB at 4.3 KB/sec)
Downloading: http://dev.davidsoergel.com/nexus/content/groups/public/org/apache/maven/shared/maven-shared-components/12/maven-shared-components-12.pom
Downloaded: http://dev.davidsoergel.com/nexus/content/groups/public/org/apache/maven/shared/maven-shared-components/12/maven-shared-components-12.pom (10 KB at 7.2 KB/sec)
Downloading: http://dev.davidsoergel.com/nexus/content/groups/public/org/apache/maven/maven-parent/13/maven-parent-13.pom
Downloaded: http://dev.davidsoergel.com/nexus/content/groups/public/org/apache/maven/maven-parent/13/maven-parent-13.pom (23 KB at 19.8 KB/sec)
Downloading: http://dev.davidsoergel.com/nexus/content/groups/public/org/codehaus/plexus/plexus-utils/1.5.6/plexus-utils-1.5.6.pom
Downloaded: http://dev.davidsoergel.com/nexus/content/groups/public/org/codehaus/plexus/plexus-utils/1.5.6/plexus-utils-1.5.6.pom (6 KB at 5.0 KB/sec)
Downloading: http://dev.davidsoergel.com/nexus/content/groups/public/org/codehaus/plexus/plexus/1.0.12/plexus-1.0.12.pom
Downloaded: http://dev.davidsoergel.com/nexus/content/groups/public/org/codehaus/plexus/plexus/1.0.12/plexus-1.0.12.pom (10 KB at 6.3 KB/sec)
Downloading: http://dev.davidsoergel.com/nexus/content/groups/public/net/sourceforge/cobertura/cobertura/1.9.4.1/cobertura-1.9.4.1.jar
Downloading: http://dev.davidsoergel.com/nexus/content/groups/public/oro/oro/2.0.8/oro-2.0.8.jar
Downloading: http://dev.davidsoergel.com/nexus/content/groups/public/asm/asm/3.0/asm-3.0.jar
Downloading: http://dev.davidsoergel.com/nexus/content/groups/public/asm/asm-tree/3.0/asm-tree-3.0.jar
Downloading: http://dev.davidsoergel.com/nexus/content/groups/public/log4j/log4j/1.2.9/log4j-1.2.9.jar
Downloaded: http://dev.davidsoergel.com/nexus/content/groups/public/asm/asm/3.0/asm-3.0.jar (42 KB at 26.5 KB/sec)
Downloading: http://dev.davidsoergel.com/nexus/content/groups/public/org/apache/ant/ant/1.7.0/ant-1.7.0.jar
Downloaded: http://dev.davidsoergel.com/nexus/content/groups/public/oro/oro/2.0.8/oro-2.0.8.jar (64 KB at 37.1 KB/sec)
Downloading: http://dev.davidsoergel.com/nexus/content/groups/public/org/apache/ant/ant-launcher/1.7.0/ant-launcher-1.7.0.jar
Downloaded: http://dev.davidsoergel.com/nexus/content/groups/public/asm/asm-tree/3.0/asm-tree-3.0.jar (22 KB at 12.2 KB/sec)
Downloading: http://dev.davidsoergel.com/nexus/content/groups/public/urbanophile/java-getopt/1.0.9/java-getopt-1.0.9.jar
Downloaded: http://dev.davidsoergel.com/nexus/content/groups/public/net/sourceforge/cobertura/cobertura/1.9.4.1/cobertura-1.9.4.1.jar (443 KB at 243.7 KB/sec)
Downloaded: http://dev.davidsoergel.com/nexus/content/groups/public/log4j/log4j/1.2.9/log4j-1.2.9.jar (345 KB at 197.6 KB/sec)
Downloading: http://dev.davidsoergel.com/nexus/content/groups/public/commons-cli/commons-cli/1.0/commons-cli-1.0.jar
Downloading: http://dev.davidsoergel.com/nexus/content/groups/public/org/codehaus/plexus/plexus-interactivity-api/1.0-alpha-4/plexus-interactivity-api-1.0-alpha-4.jar
Downloaded: http://dev.davidsoergel.com/nexus/content/groups/public/org/apache/ant/ant-launcher/1.7.0/ant-launcher-1.7.0.jar (12 KB at 6.1 KB/sec)
Downloading: http://dev.davidsoergel.com/nexus/content/groups/public/org/apache/maven/reporting/maven-reporting-api/2.0.8/maven-reporting-api-2.0.8.jar
Downloaded: http://dev.davidsoergel.com/nexus/content/groups/public/commons-cli/commons-cli/1.0/commons-cli-1.0.jar (30 KB at 16.1 KB/sec)
Downloading: http://dev.davidsoergel.com/nexus/content/groups/public/org/apache/maven/doxia/doxia-sink-api/1.0-alpha-9/doxia-sink-api-1.0-alpha-9.jar
Downloaded: http://dev.davidsoergel.com/nexus/content/groups/public/org/codehaus/plexus/plexus-interactivity-api/1.0-alpha-4/plexus-interactivity-api-1.0-alpha-4.jar (14 KB at 7.1 KB/sec)
Downloading: http://dev.davidsoergel.com/nexus/content/groups/public/org/apache/maven/reporting/maven-reporting-impl/2.0.4.2/maven-reporting-impl-2.0.4.2.jar
Downloaded: http://dev.davidsoergel.com/nexus/content/groups/public/urbanophile/java-getopt/1.0.9/java-getopt-1.0.9.jar (53 KB at 27.3 KB/sec)
Downloading: http://dev.davidsoergel.com/nexus/content/groups/public/commons-validator/commons-validator/1.2.0/commons-validator-1.2.0.jar
Downloaded: http://dev.davidsoergel.com/nexus/content/groups/public/org/apache/ant/ant/1.7.0/ant-1.7.0.jar (1260 KB at 566.9 KB/sec)
Downloading: http://dev.davidsoergel.com/nexus/content/groups/public/commons-beanutils/commons-beanutils/1.7.0/commons-beanutils-1.7.0.jar
Downloaded: http://dev.davidsoergel.com/nexus/content/groups/public/org/apache/maven/doxia/doxia-sink-api/1.0-alpha-9/doxia-sink-api-1.0-alpha-9.jar (10 KB at 25.7 KB/sec)
Downloading: http://dev.davidsoergel.com/nexus/content/groups/public/commons-digester/commons-digester/1.6/commons-digester-1.6.jar
Downloaded: http://dev.davidsoergel.com/nexus/content/groups/public/commons-validator/commons-validator/1.2.0/commons-validator-1.2.0.jar (89 KB at 217.5 KB/sec)
Downloading: http://dev.davidsoergel.com/nexus/content/groups/public/xml-apis/xml-apis/1.0.b2/xml-apis-1.0.b2.jar
Downloaded: http://dev.davidsoergel.com/nexus/content/groups/public/org/apache/maven/reporting/maven-reporting-impl/2.0.4.2/maven-reporting-impl-2.0.4.2.jar (20 KB at 41.2 KB/sec)
Downloading: http://dev.davidsoergel.com/nexus/content/groups/public/org/apache/maven/doxia/doxia-core/1.0/doxia-core-1.0.jar
Downloaded: http://dev.davidsoergel.com/nexus/content/groups/public/org/apache/maven/reporting/maven-reporting-api/2.0.8/maven-reporting-api-2.0.8.jar (10 KB at 15.8 KB/sec)
Downloading: http://dev.davidsoergel.com/nexus/content/groups/public/org/apache/maven/doxia/doxia-site-renderer/1.0/doxia-site-renderer-1.0.jar
Downloaded: http://dev.davidsoergel.com/nexus/content/groups/public/commons-beanutils/commons-beanutils/1.7.0/commons-beanutils-1.7.0.jar (185 KB at 374.5 KB/sec)
Downloading: http://dev.davidsoergel.com/nexus/content/groups/public/org/codehaus/plexus/plexus-i18n/1.0-beta-7/plexus-i18n-1.0-beta-7.jar
Downloaded: http://dev.davidsoergel.com/nexus/content/groups/public/org/apache/maven/doxia/doxia-core/1.0/doxia-core-1.0.jar (54 KB at 140.1 KB/sec)
Downloading: http://dev.davidsoergel.com/nexus/content/groups/public/org/codehaus/plexus/plexus-velocity/1.1.7/plexus-velocity-1.1.7.jar
Downloaded: http://dev.davidsoergel.com/nexus/content/groups/public/org/apache/maven/doxia/doxia-site-renderer/1.0/doxia-site-renderer-1.0.jar (46 KB at 149.9 KB/sec)
Downloading: http://dev.davidsoergel.com/nexus/content/groups/public/org/apache/velocity/velocity/1.5/velocity-1.5.jar
Downloaded: http://dev.davidsoergel.com/nexus/content/groups/public/commons-digester/commons-digester/1.6/commons-digester-1.6.jar (165 KB at 274.2 KB/sec)
Downloaded: http://dev.davidsoergel.com/nexus/content/groups/public/xml-apis/xml-apis/1.0.b2/xml-apis-1.0.b2.jar (107 KB at 215.2 KB/sec)
Downloading: http://dev.davidsoergel.com/nexus/content/groups/public/org/apache/maven/doxia/doxia-decoration-model/1.0/doxia-decoration-model-1.0.jar
Downloading: http://dev.davidsoergel.com/nexus/content/groups/public/org/apache/maven/doxia/doxia-module-apt/1.0/doxia-module-apt-1.0.jar
Downloaded: http://dev.davidsoergel.com/nexus/content/groups/public/org/codehaus/plexus/plexus-i18n/1.0-beta-7/plexus-i18n-1.0-beta-7.jar (11 KB at 27.5 KB/sec)
Downloading: http://dev.davidsoergel.com/nexus/content/groups/public/org/apache/maven/doxia/doxia-module-fml/1.0/doxia-module-fml-1.0.jar
Downloaded: http://dev.davidsoergel.com/nexus/content/groups/public/org/codehaus/plexus/plexus-velocity/1.1.7/plexus-velocity-1.1.7.jar (8 KB at 19.7 KB/sec)
Downloading: http://dev.davidsoergel.com/nexus/content/groups/public/org/apache/maven/doxia/doxia-module-xdoc/1.0/doxia-module-xdoc-1.0.jar
Downloaded: http://dev.davidsoergel.com/nexus/content/groups/public/org/apache/maven/doxia/doxia-decoration-model/1.0/doxia-decoration-model-1.0.jar (48 KB at 94.7 KB/sec)
Downloading: http://dev.davidsoergel.com/nexus/content/groups/public/org/apache/maven/doxia/doxia-module-xhtml/1.0/doxia-module-xhtml-1.0.jar
Downloaded: http://dev.davidsoergel.com/nexus/content/groups/public/org/apache/maven/doxia/doxia-module-fml/1.0/doxia-module-fml-1.0.jar (19 KB at 44.3 KB/sec)
Downloading: http://dev.davidsoergel.com/nexus/content/groups/public/commons-lang/commons-lang/2.4/commons-lang-2.4.jar
Downloaded: http://dev.davidsoergel.com/nexus/content/groups/public/org/apache/velocity/velocity/1.5/velocity-1.5.jar (383 KB at 574.1 KB/sec)
Downloading: http://dev.davidsoergel.com/nexus/content/groups/public/org/codehaus/plexus/plexus-utils/2.0.2/plexus-utils-2.0.2.jar
Downloaded: http://dev.davidsoergel.com/nexus/content/groups/public/org/apache/maven/doxia/doxia-module-apt/1.0/doxia-module-apt-1.0.jar (46 KB at 78.2 KB/sec)
Downloading: http://dev.davidsoergel.com/nexus/content/groups/public/org/apache/maven/shared/maven-invoker/2.0.11/maven-invoker-2.0.11.jar
Downloaded: http://dev.davidsoergel.com/nexus/content/groups/public/org/apache/maven/doxia/doxia-module-xdoc/1.0/doxia-module-xdoc-1.0.jar (28 KB at 84.6 KB/sec)
Downloaded: http://dev.davidsoergel.com/nexus/content/groups/public/org/apache/maven/shared/maven-invoker/2.0.11/maven-invoker-2.0.11.jar (29 KB at 151.8 KB/sec)
Downloaded: http://dev.davidsoergel.com/nexus/content/groups/public/org/apache/maven/doxia/doxia-module-xhtml/1.0/doxia-module-xhtml-1.0.jar (22 KB at 55.9 KB/sec)
Downloaded: http://dev.davidsoergel.com/nexus/content/groups/public/org/codehaus/plexus/plexus-utils/2.0.2/plexus-utils-2.0.2.jar (218 KB at 485.3 KB/sec)
Downloaded: http://dev.davidsoergel.com/nexus/content/groups/public/commons-lang/commons-lang/2.4/commons-lang-2.4.jar (256 KB at 443.9 KB/sec)
mojoSucceeded org.codehaus.mojo:cobertura-maven-plugin:2.5.1(clean)
Dec 2, 2012 12:15:04 AM hudson.maven.ExecutedMojo <init>
WARNING: Failed to getClass for org.apache.maven.plugin.source.SourceJarMojo
Downloading: http://dev.davidsoergel.com/nexus/content/groups/public/org/apache/maven/maven-model/2.0.9/maven-model-2.0.9.pom
mojoStarted org.apache.maven.plugins:maven-source-plugin:2.2.1(default-cli)
[INFO] 
[INFO] --- maven-source-plugin:2.2.1:jar (default-cli) @ jlibsvm ---
Downloaded: http://dev.davidsoergel.com/nexus/content/groups/public/org/apache/maven/maven-model/2.0.9/maven-model-2.0.9.pom (4 KB at 10.7 KB/sec)
Downloading: http://dev.davidsoergel.com/nexus/content/groups/public/org/apache/maven/maven/2.0.9/maven-2.0.9.pom
Downloaded: http://dev.davidsoergel.com/nexus/content/groups/public/org/apache/maven/maven/2.0.9/maven-2.0.9.pom (19 KB at 88.8 KB/sec)
Downloading: http://dev.davidsoergel.com/nexus/content/groups/public/org/apache/maven/maven-parent/8/maven-parent-8.pom
Downloaded: http://dev.davidsoergel.com/nexus/content/groups/public/org/apache/maven/maven-parent/8/maven-parent-8.pom (24 KB at 123.4 KB/sec)
Downloading: http://dev.davidsoergel.com/nexus/content/groups/public/org/codehaus/plexus/plexus-utils/1.5.1/plexus-utils-1.5.1.pom
Downloaded: http://dev.davidsoergel.com/nexus/content/groups/public/org/codehaus/plexus/plexus-utils/1.5.1/plexus-utils-1.5.1.pom (3 KB at 13.7 KB/sec)
Downloading: http://dev.davidsoergel.com/nexus/content/groups/public/org/apache/maven/maven-artifact/2.0.9/maven-artifact-2.0.9.pom
Downloaded: http://dev.davidsoergel.com/nexus/content/groups/public/org/apache/maven/maven-artifact/2.0.9/maven-artifact-2.0.9.pom (2 KB at 11.5 KB/sec)
Downloading: http://dev.davidsoergel.com/nexus/content/groups/public/org/apache/maven/maven-plugin-api/2.0.9/maven-plugin-api-2.0.9.pom
Downloaded: http://dev.davidsoergel.com/nexus/content/groups/public/org/apache/maven/maven-plugin-api/2.0.9/maven-plugin-api-2.0.9.pom (2 KB at 20.0 KB/sec)
Downloading: http://dev.davidsoergel.com/nexus/content/groups/public/org/apache/maven/maven-project/2.0.9/maven-project-2.0.9.pom
Downloaded: http://dev.davidsoergel.com/nexus/content/groups/public/org/apache/maven/maven-project/2.0.9/maven-project-2.0.9.pom (3 KB at 4.9 KB/sec)
Downloading: http://dev.davidsoergel.com/nexus/content/groups/public/org/apache/maven/maven-settings/2.0.9/maven-settings-2.0.9.pom
Downloaded: http://dev.davidsoergel.com/nexus/content/groups/public/org/apache/maven/maven-settings/2.0.9/maven-settings-2.0.9.pom (3 KB at 7.3 KB/sec)
Downloading: http://dev.davidsoergel.com/nexus/content/groups/public/org/apache/maven/maven-profile/2.0.9/maven-profile-2.0.9.pom
Downloaded: http://dev.davidsoergel.com/nexus/content/groups/public/org/apache/maven/maven-profile/2.0.9/maven-profile-2.0.9.pom (3 KB at 6.1 KB/sec)
Downloading: http://dev.davidsoergel.com/nexus/content/groups/public/org/apache/maven/maven-artifact-manager/2.0.9/maven-artifact-manager-2.0.9.pom
Downloaded: http://dev.davidsoergel.com/nexus/content/groups/public/org/apache/maven/maven-artifact-manager/2.0.9/maven-artifact-manager-2.0.9.pom (3 KB at 9.5 KB/sec)
Downloading: http://dev.davidsoergel.com/nexus/content/groups/public/org/apache/maven/maven-repository-metadata/2.0.9/maven-repository-metadata-2.0.9.pom
Downloaded: http://dev.davidsoergel.com/nexus/content/groups/public/org/apache/maven/maven-repository-metadata/2.0.9/maven-repository-metadata-2.0.9.pom (2 KB at 9.0 KB/sec)
Downloading: http://dev.davidsoergel.com/nexus/content/groups/public/org/apache/maven/maven-plugin-registry/2.0.9/maven-plugin-registry-2.0.9.pom
Downloaded: http://dev.davidsoergel.com/nexus/content/groups/public/org/apache/maven/maven-plugin-registry/2.0.9/maven-plugin-registry-2.0.9.pom (2 KB at 5.9 KB/sec)
Downloading: http://dev.davidsoergel.com/nexus/content/groups/public/org/apache/maven/maven-archiver/2.5/maven-archiver-2.5.pom
Downloaded: http://dev.davidsoergel.com/nexus/content/groups/public/org/apache/maven/maven-archiver/2.5/maven-archiver-2.5.pom (5 KB at 13.2 KB/sec)
Downloading: http://dev.davidsoergel.com/nexus/content/groups/public/org/apache/maven/shared/maven-shared-components/17/maven-shared-components-17.pom
Downloaded: http://dev.davidsoergel.com/nexus/content/groups/public/org/apache/maven/shared/maven-shared-components/17/maven-shared-components-17.pom (9 KB at 31.5 KB/sec)
Downloading: http://dev.davidsoergel.com/nexus/content/groups/public/org/apache/maven/maven-artifact/2.0.6/maven-artifact-2.0.6.pom
Downloaded: http://dev.davidsoergel.com/nexus/content/groups/public/org/apache/maven/maven-artifact/2.0.6/maven-artifact-2.0.6.pom (2 KB at 5.7 KB/sec)
Downloading: http://dev.davidsoergel.com/nexus/content/groups/public/org/apache/maven/maven-model/2.0.6/maven-model-2.0.6.pom
Downloaded: http://dev.davidsoergel.com/nexus/content/groups/public/org/apache/maven/maven-model/2.0.6/maven-model-2.0.6.pom (3 KB at 7.4 KB/sec)
Downloading: http://dev.davidsoergel.com/nexus/content/groups/public/org/apache/maven/maven-core/2.0.6/maven-core-2.0.6.pom
Downloaded: http://dev.davidsoergel.com/nexus/content/groups/public/org/apache/maven/maven-core/2.0.6/maven-core-2.0.6.pom (7 KB at 53.3 KB/sec)
Downloading: http://dev.davidsoergel.com/nexus/content/groups/public/org/apache/maven/maven-settings/2.0.6/maven-settings-2.0.6.pom
Downloaded: http://dev.davidsoergel.com/nexus/content/groups/public/org/apache/maven/maven-settings/2.0.6/maven-settings-2.0.6.pom (2 KB at 7.9 KB/sec)
Downloading: http://dev.davidsoergel.com/nexus/content/groups/public/org/apache/maven/maven-plugin-parameter-documenter/2.0.6/maven-plugin-parameter-documenter-2.0.6.pom
Downloaded: http://dev.davidsoergel.com/nexus/content/groups/public/org/apache/maven/maven-plugin-parameter-documenter/2.0.6/maven-plugin-parameter-documenter-2.0.6.pom (2 KB at 11.0 KB/sec)
Downloading: http://dev.davidsoergel.com/nexus/content/groups/public/org/apache/maven/reporting/maven-reporting-api/2.0.6/maven-reporting-api-2.0.6.pom
Downloaded: http://dev.davidsoergel.com/nexus/content/groups/public/org/apache/maven/reporting/maven-reporting-api/2.0.6/maven-reporting-api-2.0.6.pom (2 KB at 6.5 KB/sec)
Downloading: http://dev.davidsoergel.com/nexus/content/groups/public/org/apache/maven/reporting/maven-reporting/2.0.6/maven-reporting-2.0.6.pom
Downloaded: http://dev.davidsoergel.com/nexus/content/groups/public/org/apache/maven/reporting/maven-reporting/2.0.6/maven-reporting-2.0.6.pom (2 KB at 2.6 KB/sec)
Downloading: http://dev.davidsoergel.com/nexus/content/groups/public/org/apache/maven/maven-profile/2.0.6/maven-profile-2.0.6.pom
Downloaded: http://dev.davidsoergel.com/nexus/content/groups/public/org/apache/maven/maven-profile/2.0.6/maven-profile-2.0.6.pom (2 KB at 3.0 KB/sec)
Downloading: http://dev.davidsoergel.com/nexus/content/groups/public/org/apache/maven/maven-repository-metadata/2.0.6/maven-repository-metadata-2.0.6.pom
Downloaded: http://dev.davidsoergel.com/nexus/content/groups/public/org/apache/maven/maven-repository-metadata/2.0.6/maven-repository-metadata-2.0.6.pom (2 KB at 4.8 KB/sec)
Downloading: http://dev.davidsoergel.com/nexus/content/groups/public/org/apache/maven/maven-error-diagnostics/2.0.6/maven-error-diagnostics-2.0.6.pom
Downloaded: http://dev.davidsoergel.com/nexus/content/groups/public/org/apache/maven/maven-error-diagnostics/2.0.6/maven-error-diagnostics-2.0.6.pom (2 KB at 0.9 KB/sec)
Downloading: http://dev.davidsoergel.com/nexus/content/groups/public/org/apache/maven/maven-project/2.0.6/maven-project-2.0.6.pom
Downloaded: http://dev.davidsoergel.com/nexus/content/groups/public/org/apache/maven/maven-project/2.0.6/maven-project-2.0.6.pom (3 KB at 2.7 KB/sec)
Downloading: http://dev.davidsoergel.com/nexus/content/groups/public/org/apache/maven/maven-artifact-manager/2.0.6/maven-artifact-manager-2.0.6.pom
Downloaded: http://dev.davidsoergel.com/nexus/content/groups/public/org/apache/maven/maven-artifact-manager/2.0.6/maven-artifact-manager-2.0.6.pom (3 KB at 4.2 KB/sec)
Downloading: http://dev.davidsoergel.com/nexus/content/groups/public/org/apache/maven/maven-plugin-registry/2.0.6/maven-plugin-registry-2.0.6.pom
Downloaded: http://dev.davidsoergel.com/nexus/content/groups/public/org/apache/maven/maven-plugin-registry/2.0.6/maven-plugin-registry-2.0.6.pom (2 KB at 3.4 KB/sec)
Downloading: http://dev.davidsoergel.com/nexus/content/groups/public/org/apache/maven/maven-plugin-descriptor/2.0.6/maven-plugin-descriptor-2.0.6.pom
Downloaded: http://dev.davidsoergel.com/nexus/content/groups/public/org/apache/maven/maven-plugin-descriptor/2.0.6/maven-plugin-descriptor-2.0.6.pom (2 KB at 2.5 KB/sec)
Downloading: http://dev.davidsoergel.com/nexus/content/groups/public/org/apache/maven/maven-monitor/2.0.6/maven-monitor-2.0.6.pom
Downloaded: http://dev.davidsoergel.com/nexus/content/groups/public/org/apache/maven/maven-monitor/2.0.6/maven-monitor-2.0.6.pom (2 KB at 3.2 KB/sec)
Downloading: http://dev.davidsoergel.com/nexus/content/groups/public/org/codehaus/plexus/plexus-archiver/2.1/plexus-archiver-2.1.pom
Downloaded: http://dev.davidsoergel.com/nexus/content/groups/public/org/codehaus/plexus/plexus-archiver/2.1/plexus-archiver-2.1.pom (3 KB at 2.2 KB/sec)
Downloading: http://dev.davidsoergel.com/nexus/content/groups/public/org/sonatype/spice/spice-parent/17/spice-parent-17.pom
Downloaded: http://dev.davidsoergel.com/nexus/content/groups/public/org/sonatype/spice/spice-parent/17/spice-parent-17.pom (7 KB at 0.7 KB/sec)
Downloading: http://dev.davidsoergel.com/nexus/content/groups/public/org/sonatype/forge/forge-parent/10/forge-parent-10.pom
Downloaded: http://dev.davidsoergel.com/nexus/content/groups/public/org/sonatype/forge/forge-parent/10/forge-parent-10.pom (14 KB at 6.9 KB/sec)
Downloading: http://dev.davidsoergel.com/nexus/content/groups/public/org/codehaus/plexus/plexus-utils/3.0/plexus-utils-3.0.pom
Downloaded: http://dev.davidsoergel.com/nexus/content/groups/public/org/codehaus/plexus/plexus-utils/3.0/plexus-utils-3.0.pom (4 KB at 7.8 KB/sec)
Downloading: http://dev.davidsoergel.com/nexus/content/groups/public/org/sonatype/spice/spice-parent/16/spice-parent-16.pom
Downloaded: http://dev.davidsoergel.com/nexus/content/groups/public/org/sonatype/spice/spice-parent/16/spice-parent-16.pom (9 KB at 32.8 KB/sec)
Downloading: http://dev.davidsoergel.com/nexus/content/groups/public/org/sonatype/forge/forge-parent/5/forge-parent-5.pom
Downloaded: http://dev.davidsoergel.com/nexus/content/groups/public/org/sonatype/forge/forge-parent/5/forge-parent-5.pom (9 KB at 24.2 KB/sec)
Downloading: http://dev.davidsoergel.com/nexus/content/groups/public/org/codehaus/plexus/plexus-io/2.0.2/plexus-io-2.0.2.pom
Downloaded: http://dev.davidsoergel.com/nexus/content/groups/public/org/codehaus/plexus/plexus-io/2.0.2/plexus-io-2.0.2.pom (2 KB at 1.6 KB/sec)
Downloading: http://dev.davidsoergel.com/nexus/content/groups/public/org/codehaus/plexus/plexus-components/1.1.19/plexus-components-1.1.19.pom
Downloaded: http://dev.davidsoergel.com/nexus/content/groups/public/org/codehaus/plexus/plexus-components/1.1.19/plexus-components-1.1.19.pom (3 KB at 4.2 KB/sec)
Downloading: http://dev.davidsoergel.com/nexus/content/groups/public/org/codehaus/plexus/plexus/3.0.1/plexus-3.0.1.pom
Downloaded: http://dev.davidsoergel.com/nexus/content/groups/public/org/codehaus/plexus/plexus/3.0.1/plexus-3.0.1.pom (19 KB at 46.6 KB/sec)
Downloading: http://dev.davidsoergel.com/nexus/content/groups/public/org/codehaus/plexus/plexus-interpolation/1.15/plexus-interpolation-1.15.pom
Downloaded: http://dev.davidsoergel.com/nexus/content/groups/public/org/codehaus/plexus/plexus-interpolation/1.15/plexus-interpolation-1.15.pom (1018 B at 0.8 KB/sec)
Downloading: http://dev.davidsoergel.com/nexus/content/groups/public/org/codehaus/plexus/plexus-archiver/2.2/plexus-archiver-2.2.pom
Downloaded: http://dev.davidsoergel.com/nexus/content/groups/public/org/codehaus/plexus/plexus-archiver/2.2/plexus-archiver-2.2.pom (4 KB at 1.4 KB/sec)
Downloading: http://dev.davidsoergel.com/nexus/content/groups/public/org/codehaus/plexus/plexus-components/1.1.20/plexus-components-1.1.20.pom
Downloaded: http://dev.davidsoergel.com/nexus/content/groups/public/org/codehaus/plexus/plexus-components/1.1.20/plexus-components-1.1.20.pom (3 KB at 8.7 KB/sec)
Downloading: http://dev.davidsoergel.com/nexus/content/groups/public/org/codehaus/plexus/plexus/3.1/plexus-3.1.pom
Downloaded: http://dev.davidsoergel.com/nexus/content/groups/public/org/codehaus/plexus/plexus/3.1/plexus-3.1.pom (19 KB at 27.2 KB/sec)
Downloading: http://dev.davidsoergel.com/nexus/content/groups/public/org/codehaus/plexus/plexus-utils/3.0.7/plexus-utils-3.0.7.pom
Downloaded: http://dev.davidsoergel.com/nexus/content/groups/public/org/codehaus/plexus/plexus-utils/3.0.7/plexus-utils-3.0.7.pom (3 KB at 4.4 KB/sec)
Downloading: http://dev.davidsoergel.com/nexus/content/groups/public/org/codehaus/plexus/plexus-io/2.0.4/plexus-io-2.0.4.pom
Downloaded: http://dev.davidsoergel.com/nexus/content/groups/public/org/codehaus/plexus/plexus-io/2.0.4/plexus-io-2.0.4.pom (2 KB at 3.1 KB/sec)
Downloading: http://dev.davidsoergel.com/nexus/content/groups/public/org/codehaus/plexus/plexus-utils/3.0.8/plexus-utils-3.0.8.pom
Downloaded: http://dev.davidsoergel.com/nexus/content/groups/public/org/codehaus/plexus/plexus-utils/3.0.8/plexus-utils-3.0.8.pom (4 KB at 4.8 KB/sec)
Downloading: http://dev.davidsoergel.com/nexus/content/groups/public/org/codehaus/plexus/plexus/3.2/plexus-3.2.pom
Downloaded: http://dev.davidsoergel.com/nexus/content/groups/public/org/codehaus/plexus/plexus/3.2/plexus-3.2.pom (19 KB at 6.9 KB/sec)
Downloading: http://dev.davidsoergel.com/nexus/content/groups/public/org/apache/maven/maven-archiver/2.5/maven-archiver-2.5.jar
Downloading: http://dev.davidsoergel.com/nexus/content/groups/public/org/apache/maven/reporting/maven-reporting-api/2.0.6/maven-reporting-api-2.0.6.jar
Downloading: http://dev.davidsoergel.com/nexus/content/groups/public/org/apache/maven/doxia/doxia-sink-api/1.0-alpha-7/doxia-sink-api-1.0-alpha-7.jar
Downloading: http://dev.davidsoergel.com/nexus/content/groups/public/org/codehaus/plexus/plexus-interpolation/1.15/plexus-interpolation-1.15.jar
Downloading: http://dev.davidsoergel.com/nexus/content/groups/public/org/codehaus/plexus/plexus-archiver/2.2/plexus-archiver-2.2.jar
Downloaded: http://dev.davidsoergel.com/nexus/content/groups/public/org/apache/maven/reporting/maven-reporting-api/2.0.6/maven-reporting-api-2.0.6.jar (10 KB at 19.0 KB/sec)
Downloading: http://dev.davidsoergel.com/nexus/content/groups/public/org/codehaus/plexus/plexus-io/2.0.4/plexus-io-2.0.4.jar
Downloaded: http://dev.davidsoergel.com/nexus/content/groups/public/org/apache/maven/maven-archiver/2.5/maven-archiver-2.5.jar (22 KB at 34.9 KB/sec)
Downloading: http://dev.davidsoergel.com/nexus/content/groups/public/org/codehaus/plexus/plexus-utils/3.0.8/plexus-utils-3.0.8.jar
Downloaded: http://dev.davidsoergel.com/nexus/content/groups/public/org/apache/maven/doxia/doxia-sink-api/1.0-alpha-7/doxia-sink-api-1.0-alpha-7.jar (6 KB at 8.4 KB/sec)
Downloaded: http://dev.davidsoergel.com/nexus/content/groups/public/org/codehaus/plexus/plexus-interpolation/1.15/plexus-interpolation-1.15.jar (60 KB at 59.1 KB/sec)
Downloaded: http://dev.davidsoergel.com/nexus/content/groups/public/org/codehaus/plexus/plexus-archiver/2.2/plexus-archiver-2.2.jar (181 KB at 174.4 KB/sec)
Downloaded: http://dev.davidsoergel.com/nexus/content/groups/public/org/codehaus/plexus/plexus-io/2.0.4/plexus-io-2.0.4.jar (57 KB at 68.2 KB/sec)
Downloaded: http://dev.davidsoergel.com/nexus/content/groups/public/org/codehaus/plexus/plexus-utils/3.0.8/plexus-utils-3.0.8.jar (227 KB at 163.2 KB/sec)
[INFO] Building jar: /media/ephemeral0/workspace/jlibsvm/target/jlibsvm-0.92-SNAPSHOT-sources.jar
mojoSucceeded org.apache.maven.plugins:maven-source-plugin:2.2.1(default-cli)
mojoStarted org.apache.maven.plugins:maven-resources-plugin:2.5(default-resources)Downloading: http://dev.davidsoergel.com/nexus/content/groups/public/org/apache/maven/shared/maven-filtering/1.0/maven-filtering-1.0.pom

[INFO] 
[INFO] --- maven-resources-plugin:2.5:resources (default-resources) @ jlibsvm ---
Downloaded: http://dev.davidsoergel.com/nexus/content/groups/public/org/apache/maven/shared/maven-filtering/1.0/maven-filtering-1.0.pom (6 KB at 42.3 KB/sec)
Downloading: http://dev.davidsoergel.com/nexus/content/groups/public/org/apache/maven/shared/maven-shared-components/16/maven-shared-components-16.pom
Downloaded: http://dev.davidsoergel.com/nexus/content/groups/public/org/apache/maven/shared/maven-shared-components/16/maven-shared-components-16.pom (9 KB at 48.0 KB/sec)
Downloading: http://dev.davidsoergel.com/nexus/content/groups/public/org/codehaus/plexus/plexus-interpolation/1.12/plexus-interpolation-1.12.pom
Downloaded: http://dev.davidsoergel.com/nexus/content/groups/public/org/codehaus/plexus/plexus-interpolation/1.12/plexus-interpolation-1.12.pom (889 B at 6.7 KB/sec)
Downloading: http://dev.davidsoergel.com/nexus/content/groups/public/org/sonatype/plexus/plexus-build-api/0.0.4/plexus-build-api-0.0.4.pom
Downloaded: http://dev.davidsoergel.com/nexus/content/groups/public/org/sonatype/plexus/plexus-build-api/0.0.4/plexus-build-api-0.0.4.pom (3 KB at 19.1 KB/sec)
Downloading: http://dev.davidsoergel.com/nexus/content/groups/public/org/sonatype/spice/spice-parent/10/spice-parent-10.pom
Downloaded: http://dev.davidsoergel.com/nexus/content/groups/public/org/sonatype/spice/spice-parent/10/spice-parent-10.pom (3 KB at 18.3 KB/sec)
Downloading: http://dev.davidsoergel.com/nexus/content/groups/public/org/sonatype/forge/forge-parent/3/forge-parent-3.pom
Downloaded: http://dev.davidsoergel.com/nexus/content/groups/public/org/sonatype/forge/forge-parent/3/forge-parent-3.pom (5 KB at 26.1 KB/sec)
Downloading: http://dev.davidsoergel.com/nexus/content/groups/public/org/codehaus/plexus/plexus-utils/1.5.8/plexus-utils-1.5.8.pom
Downloaded: http://dev.davidsoergel.com/nexus/content/groups/public/org/codehaus/plexus/plexus-utils/1.5.8/plexus-utils-1.5.8.pom (8 KB at 44.2 KB/sec)
Downloading: http://dev.davidsoergel.com/nexus/content/groups/public/org/codehaus/plexus/plexus-interpolation/1.13/plexus-interpolation-1.13.pom
Downloaded: http://dev.davidsoergel.com/nexus/content/groups/public/org/codehaus/plexus/plexus-interpolation/1.13/plexus-interpolation-1.13.pom (890 B at 4.3 KB/sec)
Downloading: http://dev.davidsoergel.com/nexus/content/groups/public/org/codehaus/plexus/plexus-components/1.1.15/plexus-components-1.1.15.pom
Downloaded: http://dev.davidsoergel.com/nexus/content/groups/public/org/codehaus/plexus/plexus-components/1.1.15/plexus-components-1.1.15.pom (3 KB at 6.4 KB/sec)
Downloading: http://dev.davidsoergel.com/nexus/content/groups/public/org/codehaus/plexus/plexus/2.0.3/plexus-2.0.3.pom
Downloaded: http://dev.davidsoergel.com/nexus/content/groups/public/org/codehaus/plexus/plexus/2.0.3/plexus-2.0.3.pom (16 KB at 31.8 KB/sec)
Downloading: http://dev.davidsoergel.com/nexus/content/groups/public/org/apache/maven/shared/maven-filtering/1.0/maven-filtering-1.0.jar
Downloading: http://dev.davidsoergel.com/nexus/content/groups/public/org/sonatype/plexus/plexus-build-api/0.0.4/plexus-build-api-0.0.4.jar
Downloading: http://dev.davidsoergel.com/nexus/content/groups/public/org/codehaus/plexus/plexus-interpolation/1.13/plexus-interpolation-1.13.jar
Downloaded: http://dev.davidsoergel.com/nexus/content/groups/public/org/apache/maven/shared/maven-filtering/1.0/maven-filtering-1.0.jar (42 KB at 119.8 KB/sec)
Downloaded: http://dev.davidsoergel.com/nexus/content/groups/public/org/sonatype/plexus/plexus-build-api/0.0.4/plexus-build-api-0.0.4.jar (7 KB at 9.7 KB/sec)
Downloaded: http://dev.davidsoergel.com/nexus/content/groups/public/org/codehaus/plexus/plexus-interpolation/1.13/plexus-interpolation-1.13.jar (60 KB at 72.7 KB/sec)
[debug] execute contextualize
[INFO] Using 'UTF-8' encoding to copy filtered resources.
[INFO] Copying 1 resource
mojoSucceeded org.apache.maven.plugins:maven-resources-plugin:2.5(default-resources)
mojoStarted org.apache.maven.plugins:maven-compiler-plugin:2.4(default-compile)
Downloading: http://dev.davidsoergel.com/nexus/content/groups/public/org/apache/maven/maven-core/2.0.9/maven-core-2.0.9.pom
[INFO] 
[INFO] --- maven-compiler-plugin:2.4:compile (default-compile) @ jlibsvm ---
Downloaded: http://dev.davidsoergel.com/nexus/content/groups/public/org/apache/maven/maven-core/2.0.9/maven-core-2.0.9.pom (8 KB at 46.9 KB/sec)
Downloading: http://dev.davidsoergel.com/nexus/content/groups/public/org/apache/maven/maven-plugin-parameter-documenter/2.0.9/maven-plugin-parameter-documenter-2.0.9.pom
Downloaded: http://dev.davidsoergel.com/nexus/content/groups/public/org/apache/maven/maven-plugin-parameter-documenter/2.0.9/maven-plugin-parameter-documenter-2.0.9.pom (2 KB at 3.6 KB/sec)
Downloading: http://dev.davidsoergel.com/nexus/content/groups/public/org/apache/maven/maven-error-diagnostics/2.0.9/maven-error-diagnostics-2.0.9.pom
Downloaded: http://dev.davidsoergel.com/nexus/content/groups/public/org/apache/maven/maven-error-diagnostics/2.0.9/maven-error-diagnostics-2.0.9.pom (2 KB at 7.8 KB/sec)
Downloading: http://dev.davidsoergel.com/nexus/content/groups/public/org/apache/maven/maven-plugin-descriptor/2.0.9/maven-plugin-descriptor-2.0.9.pom
Downloaded: http://dev.davidsoergel.com/nexus/content/groups/public/org/apache/maven/maven-plugin-descriptor/2.0.9/maven-plugin-descriptor-2.0.9.pom (3 KB at 4.4 KB/sec)
Downloading: http://dev.davidsoergel.com/nexus/content/groups/public/org/apache/maven/maven-monitor/2.0.9/maven-monitor-2.0.9.pom
Downloaded: http://dev.davidsoergel.com/nexus/content/groups/public/org/apache/maven/maven-monitor/2.0.9/maven-monitor-2.0.9.pom (2 KB at 2.6 KB/sec)
Downloading: http://dev.davidsoergel.com/nexus/content/groups/public/org/apache/maven/maven-toolchain/1.0/maven-toolchain-1.0.pom
Downloaded: http://dev.davidsoergel.com/nexus/content/groups/public/org/apache/maven/maven-toolchain/1.0/maven-toolchain-1.0.pom (4 KB at 4.7 KB/sec)
Downloading: http://dev.davidsoergel.com/nexus/content/groups/public/org/codehaus/plexus/plexus-compiler-api/1.8.6/plexus-compiler-api-1.8.6.pom
Downloaded: http://dev.davidsoergel.com/nexus/content/groups/public/org/codehaus/plexus/plexus-compiler-api/1.8.6/plexus-compiler-api-1.8.6.pom (780 B at 0.5 KB/sec)
Downloading: http://dev.davidsoergel.com/nexus/content/groups/public/org/codehaus/plexus/plexus-compiler/1.8.6/plexus-compiler-1.8.6.pom
Downloaded: http://dev.davidsoergel.com/nexus/content/groups/public/org/codehaus/plexus/plexus-compiler/1.8.6/plexus-compiler-1.8.6.pom (4 KB at 0.9 KB/sec)
Downloading: http://dev.davidsoergel.com/nexus/content/groups/public/org/codehaus/plexus/plexus-compiler-manager/1.8.6/plexus-compiler-manager-1.8.6.pom
Downloaded: http://dev.davidsoergel.com/nexus/content/groups/public/org/codehaus/plexus/plexus-compiler-manager/1.8.6/plexus-compiler-manager-1.8.6.pom (692 B at 0.5 KB/sec)
Downloading: http://dev.davidsoergel.com/nexus/content/groups/public/org/codehaus/plexus/plexus-compiler-javac/1.8.6/plexus-compiler-javac-1.8.6.pom
Downloaded: http://dev.davidsoergel.com/nexus/content/groups/public/org/codehaus/plexus/plexus-compiler-javac/1.8.6/plexus-compiler-javac-1.8.6.pom (688 B at 3.5 KB/sec)
Downloading: http://dev.davidsoergel.com/nexus/content/groups/public/org/codehaus/plexus/plexus-compilers/1.8.6/plexus-compilers-1.8.6.pom
Downloaded: http://dev.davidsoergel.com/nexus/content/groups/public/org/codehaus/plexus/plexus-compilers/1.8.6/plexus-compilers-1.8.6.pom (2 KB at 10.0 KB/sec)
Downloading: http://dev.davidsoergel.com/nexus/content/groups/public/org/codehaus/plexus/plexus-utils/3.0/plexus-utils-3.0.jar
Downloading: http://dev.davidsoergel.com/nexus/content/groups/public/org/codehaus/plexus/plexus-compiler-api/1.8.6/plexus-compiler-api-1.8.6.jar
Downloading: http://dev.davidsoergel.com/nexus/content/groups/public/org/codehaus/plexus/plexus-compiler-manager/1.8.6/plexus-compiler-manager-1.8.6.jar
Downloading: http://dev.davidsoergel.com/nexus/content/groups/public/org/codehaus/plexus/plexus-compiler-javac/1.8.6/plexus-compiler-javac-1.8.6.jar
Downloaded: http://dev.davidsoergel.com/nexus/content/groups/public/org/codehaus/plexus/plexus-compiler-manager/1.8.6/plexus-compiler-manager-1.8.6.jar (5 KB at 14.3 KB/sec)
Downloaded: http://dev.davidsoergel.com/nexus/content/groups/public/org/codehaus/plexus/plexus-utils/3.0/plexus-utils-3.0.jar (221 KB at 661.0 KB/sec)
Downloaded: http://dev.davidsoergel.com/nexus/content/groups/public/org/codehaus/plexus/plexus-compiler-api/1.8.6/plexus-compiler-api-1.8.6.jar (19 KB at 56.9 KB/sec)
Downloaded: http://dev.davidsoergel.com/nexus/content/groups/public/org/codehaus/plexus/plexus-compiler-javac/1.8.6/plexus-compiler-javac-1.8.6.jar (13 KB at 29.1 KB/sec)
[INFO] Compiling 88 source files to /media/ephemeral0/workspace/jlibsvm/target/classes
[INFO] -------------------------------------------------------------
[ERROR] COMPILATION ERROR : 
[INFO] -------------------------------------------------------------
[ERROR] Failure executing javac, but could not parse the error:
javac: invalid target release: 1.7
Usage: javac <options> <source files>
use -help for a list of possible options

[INFO] 1 error
[INFO] -------------------------------------------------------------
mojoFailed org.apache.maven.plugins:maven-compiler-plugin:2.4(default-compile)
projectFailed edu.berkeley.compbio:jlibsvm:0.92-SNAPSHOT
sessionEnded
[INFO] ------------------------------------------------------------------------
[INFO] BUILD FAILURE
[INFO] ------------------------------------------------------------------------
[INFO] Total time: 3:27.113s
[INFO] Finished at: Sun Dec 02 00:16:17 UTC 2012
[INFO] Final Memory: 10M/25M
[INFO] ------------------------------------------------------------------------
Projects to build: [MavenProject: edu.berkeley.compbio:jlibsvm:0.92-SNAPSHOT @ /media/ephemeral0/workspace/jlibsvm/pom.xml]
[JENKINS] Archiving /media/ephemeral0/workspace/jlibsvm/pom.xml to /usr/share/apache-tomcat-7.0.22/.jenkins/jobs/jlibsvm/modules/edu.berkeley.compbio$jlibsvm/builds/2012-12-01_19-12-11/archive/edu.berkeley.compbio/jlibsvm/0.92-SNAPSHOT/jlibsvm-0.92-SNAPSHOT.pom
[JENKINS] Archiving /media/ephemeral0/workspace/jlibsvm/target/jlibsvm-0.92-SNAPSHOT-sources.jar to /usr/share/apache-tomcat-7.0.22/.jenkins/jobs/jlibsvm/modules/edu.berkeley.compbio$jlibsvm/builds/2012-12-01_19-12-11/archive/edu.berkeley.compbio/jlibsvm/0.92-SNAPSHOT/jlibsvm-0.92-SNAPSHOT-sources.jar
Waiting for Jenkins to finish collecting data
mavenExecutionResult exceptions not empty
message : Failed to execute goal org.apache.maven.plugins:maven-compiler-plugin:2.4:compile (default-compile) on project jlibsvm: Compilation failure
Failure executing javac, but could not parse the error:
javac: invalid target release: 1.7
Usage: javac <options> <source files>
use -help for a list of possible options


cause : Compilation failure
Failure executing javac, but could not parse the error:
javac: invalid target release: 1.7
Usage: javac <options> <source files>
use -help for a list of possible options


Stack trace : 
org.apache.maven.lifecycle.LifecycleExecutionException: Failed to execute goal org.apache.maven.plugins:maven-compiler-plugin:2.4:compile (default-compile) on project jlibsvm: Compilation failure
Failure executing javac, but could not parse the error:
javac: invalid target release: 1.7
Usage: javac <options> <source files>
use -help for a list of possible options


	at org.apache.maven.lifecycle.internal.MojoExecutor.execute(MojoExecutor.java:213)
	at org.apache.maven.lifecycle.internal.MojoExecutor.execute(MojoExecutor.java:153)
	at org.apache.maven.lifecycle.internal.MojoExecutor.execute(MojoExecutor.java:145)
	at org.apache.maven.lifecycle.internal.LifecycleModuleBuilder.buildProject(LifecycleModuleBuilder.java:84)
	at org.apache.maven.lifecycle.internal.LifecycleModuleBuilder.buildProject(LifecycleModuleBuilder.java:59)
	at org.apache.maven.lifecycle.internal.LifecycleStarter.singleThreadedBuild(LifecycleStarter.java:183)
	at org.apache.maven.lifecycle.internal.LifecycleStarter.execute(LifecycleStarter.java:161)
	at org.apache.maven.DefaultMaven.doExecute(DefaultMaven.java:320)
	at org.apache.maven.DefaultMaven.execute(DefaultMaven.java:156)
	at org.jvnet.hudson.maven3.launcher.Maven3Launcher.main(Maven3Launcher.java:79)
	at sun.reflect.NativeMethodAccessorImpl.invoke0(Native Method)
	at sun.reflect.NativeMethodAccessorImpl.invoke(NativeMethodAccessorImpl.java:39)
	at sun.reflect.DelegatingMethodAccessorImpl.invoke(DelegatingMethodAccessorImpl.java:25)
	at java.lang.reflect.Method.invoke(Method.java:597)
	at org.codehaus.plexus.classworlds.launcher.Launcher.launchStandard(Launcher.java:329)
	at org.codehaus.plexus.classworlds.launcher.Launcher.launch(Launcher.java:239)
	at org.jvnet.hudson.maven3.agent.Maven3Main.launch(Maven3Main.java:158)
	at hudson.maven.Maven3Builder.call(Maven3Builder.java:98)
	at hudson.maven.Maven3Builder.call(Maven3Builder.java:64)
	at hudson.remoting.UserRequest.perform(UserRequest.java:118)
	at hudson.remoting.UserRequest.perform(UserRequest.java:48)
	at hudson.remoting.Request$2.run(Request.java:326)
	at hudson.remoting.InterceptingExecutorService$1.call(InterceptingExecutorService.java:72)
	at java.util.concurrent.FutureTask$Sync.innerRun(FutureTask.java:303)
	at java.util.concurrent.FutureTask.run(FutureTask.java:138)
	at java.util.concurrent.ThreadPoolExecutor$Worker.runTask(ThreadPoolExecutor.java:886)
	at java.util.concurrent.ThreadPoolExecutor$Worker.run(ThreadPoolExecutor.java:908)
	at java.lang.Thread.run(Thread.java:662)
Caused by: org.apache.maven.plugin.CompilationFailureException: Compilation failure
Failure executing javac, but could not parse the error:
javac: invalid target release: 1.7
Usage: javac <options> <source files>
use -help for a list of possible options


	at org.apache.maven.plugin.AbstractCompilerMojo.execute(AbstractCompilerMojo.java:678)
	at org.apache.maven.plugin.CompilerMojo.execute(CompilerMojo.java:128)
	at org.apache.maven.plugin.DefaultBuildPluginManager.executeMojo(DefaultBuildPluginManager.java:101)
	at org.apache.maven.lifecycle.internal.MojoExecutor.execute(MojoExecutor.java:209)
	... 27 more
channel stopped
Sending e-mails to: dev@davidsoergel.com
Finished: FAILURE