FailedConsole Output

Started by user soergel
Building remotely on i-2c07a854 in workspace /media/ephemeral0/workspace/jlibsvm
[jlibsvm] $ hg showconfig paths.default
[jlibsvm] $ hg pull --rev default
[jlibsvm] $ hg update --clean --rev default
2 files updated, 0 files merged, 0 files removed, 0 files unresolved
[jlibsvm] $ hg --config extensions.purge= clean --all
[jlibsvm] $ hg log --rev . --template {node}
[jlibsvm] $ hg log --rev . --template {rev}
[jlibsvm] $ hg log --rev 474cc1167653bf6d80daf969efd0eeac19e2a5a2
[jlibsvm] $ hg log --template "<changeset node='{node}' author='{author|xmlescape}' rev='{rev}' date='{date}'><msg>{desc|xmlescape}</msg><added>{file_adds|stringify|xmlescape}</added><deleted>{file_dels|stringify|xmlescape}</deleted><files>{files|stringify|xmlescape}</files><parents>{parents}</parents></changeset>\n" --rev default:0 --follow --prune 474cc1167653bf6d80daf969efd0eeac19e2a5a2
 your Apache Maven build is setup to use a config with id org.jenkinsci.plugins.configfiles.maven.MavenSettingsConfig1337980147845 but cannot find the config
Parsing POMs
[jlibsvm] $ /usr/java/default/bin/java -Xmx1024M -XX:MaxPermSize=256M -cp /media/ephemeral0/maven3-agent.jar:/media/ephemeral0/tools/Maven/Maven_3.0.4/boot/plexus-classworlds-2.4.jar org.jvnet.hudson.maven3.agent.Maven3Main /media/ephemeral0/tools/Maven/Maven_3.0.4 /tmp/slave.jar /media/ephemeral0/maven3-interceptor.jar 38068
<===[JENKINS REMOTING CAPACITY]===>channel started
log4j:WARN No appenders could be found for logger (org.apache.commons.beanutils.converters.BooleanConverter).
log4j:WARN Please initialize the log4j system properly.
Executing Maven:  -B -f /media/ephemeral0/workspace/jlibsvm/pom.xml -DdevelopmentVersion=0.92-SNAPSHOT -DreleaseVersion=0.91 -U -e clean -Dresume=false release:prepare release:perform
[INFO] Error stacktraces are turned on.
[INFO] Scanning for projects...
[WARNING] 
[WARNING] Some problems were encountered while building the effective model for edu.berkeley.compbio:jlibsvm:jar:0.91-SNAPSHOT
[WARNING] 'build.plugins.plugin.version' for org.codehaus.mojo:build-helper-maven-plugin is missing. @ line 147, column 12
[WARNING] 
[WARNING] It is highly recommended to fix these problems because they threaten the stability of your build.
[WARNING] 
[WARNING] For this reason, future Maven versions might no longer support building such malformed projects.
[WARNING] 
Projects to build: [MavenProject: edu.berkeley.compbio:jlibsvm:0.91-SNAPSHOT @ /media/ephemeral0/workspace/jlibsvm/pom.xml]
Downloading: http://repo.maven.apache.org/maven2/org/codehaus/mojo/build-helper-maven-plugin/maven-metadata.xml
Downloading: http://dev.davidsoergel.com/nexus/content/groups/public/org/codehaus/mojo/build-helper-maven-plugin/maven-metadata.xml
Downloaded: http://repo.maven.apache.org/maven2/org/codehaus/mojo/build-helper-maven-plugin/maven-metadata.xml (546 B at 1.1 KB/sec)
Downloaded: http://dev.davidsoergel.com/nexus/content/groups/public/org/codehaus/mojo/build-helper-maven-plugin/maven-metadata.xml (546 B at 1.3 KB/sec)
projectStarted edu.berkeley.compbio:jlibsvm:0.91-SNAPSHOT
[INFO]                                                                         
[INFO] ------------------------------------------------------------------------
[INFO] Building jlibsvm 0.91-SNAPSHOT
[INFO] ------------------------------------------------------------------------
mojoStarted org.apache.maven.plugins:maven-clean-plugin:2.4.1(default-clean)
[INFO] 
[INFO] --- maven-clean-plugin:2.4.1:clean (default-clean) @ jlibsvm ---
mojoSucceeded org.apache.maven.plugins:maven-clean-plugin:2.4.1(default-clean)
mojoStarted org.codehaus.mojo:cobertura-maven-plugin:2.5.1(clean)
[INFO] 
[INFO] --- cobertura-maven-plugin:2.5.1:clean (clean) @ jlibsvm ---
mojoSucceeded org.codehaus.mojo:cobertura-maven-plugin:2.5.1(clean)
projectSucceeded edu.berkeley.compbio:jlibsvm:0.91-SNAPSHOT
projectStarted edu.berkeley.compbio:jlibsvm:0.91-SNAPSHOT
[INFO]                                                                         
[INFO] ------------------------------------------------------------------------
[INFO] Building jlibsvm 0.91-SNAPSHOT
[INFO] ------------------------------------------------------------------------
mojoStarted org.apache.maven.plugins:maven-release-plugin:2.0(default-cli)
[INFO] 
[INFO] --- maven-release-plugin:2.0:prepare (default-cli) @ jlibsvm ---
[INFO] Verifying that there are no local modifications...
[INFO] Executing: /bin/sh -c cd /media/ephemeral0/workspace/jlibsvm && svn --non-interactive status
[INFO] Working directory: /media/ephemeral0/workspace/jlibsvm
[INFO] Checking dependencies and plugins for snapshots ...
[INFO] Transforming 'jlibsvm'...
[INFO] Not generating release POMs
[INFO] Executing goals 'clean verify'...
[INFO] [INFO] Scanning for projects...
[INFO] [WARNING] 
[INFO] [WARNING] Some problems were encountered while building the effective model for edu.berkeley.compbio:jlibsvm:jar:0.91
[INFO] [WARNING] 'build.plugins.plugin.version' for org.codehaus.mojo:build-helper-maven-plugin is missing. @ line 148, column 12
[INFO] [WARNING] 
[INFO] [WARNING] It is highly recommended to fix these problems because they threaten the stability of your build.
[INFO] [WARNING] 
[INFO] [WARNING] For this reason, future Maven versions might no longer support building such malformed projects.
[INFO] [WARNING] 
[INFO] [INFO]                                                                         
[INFO] [INFO] ------------------------------------------------------------------------
[INFO] [INFO] Building jlibsvm 0.91
[INFO] [INFO] ------------------------------------------------------------------------
[INFO] [INFO] 
[INFO] [INFO] --- maven-clean-plugin:2.4.1:clean (default-clean) @ jlibsvm ---
[INFO] [INFO] 
[INFO] [INFO] --- cobertura-maven-plugin:2.5.1:clean (clean) @ jlibsvm ---
[INFO] [INFO] 
[INFO] [INFO] --- maven-resources-plugin:2.5:resources (default-resources) @ jlibsvm ---
[INFO] [debug] execute contextualize
[INFO] [INFO] Using 'UTF-8' encoding to copy filtered resources.
[INFO] [INFO] Copying 1 resource
[INFO] [INFO] 
[INFO] [INFO] --- maven-compiler-plugin:2.4:compile (default-compile) @ jlibsvm ---
[INFO] [INFO] Compiling 88 source files to /media/ephemeral0/workspace/jlibsvm/target/classes
[INFO] [WARNING] /media/ephemeral0/workspace/jlibsvm/src/main/java/edu/berkeley/compbio/jlibsvm/legacyexec/svm_train.java:[38,45] NotImplementedException is internal proprietary API and may be removed in a future release
[INFO] [WARNING] /media/ephemeral0/workspace/jlibsvm/src/main/java/edu/berkeley/compbio/jlibsvm/SVM.java:[6,21] NotImplementedException is internal proprietary API and may be removed in a future release
[INFO] [WARNING] /media/ephemeral0/workspace/jlibsvm/src/main/java/edu/berkeley/compbio/jlibsvm/ImmutableSvmParameter.java:[29,36] NotImplementedException is internal proprietary API and may be removed in a future release
[INFO] [WARNING] /media/ephemeral0/workspace/jlibsvm/src/main/java/edu/berkeley/compbio/jlibsvm/SolutionModel.java:[141,12] NotImplementedException is internal proprietary API and may be removed in a future release
[INFO] [WARNING] /media/ephemeral0/workspace/jlibsvm/src/main/java/edu/berkeley/compbio/jlibsvm/SolutionModel.java:[146,12] NotImplementedException is internal proprietary API and may be removed in a future release
[INFO] [WARNING] /media/ephemeral0/workspace/jlibsvm/src/main/java/edu/berkeley/compbio/jlibsvm/multi/MultiClassModel.java:[635,18] NotImplementedException is internal proprietary API and may be removed in a future release
[INFO] [WARNING] /media/ephemeral0/workspace/jlibsvm/src/main/java/edu/berkeley/compbio/jlibsvm/legacyexec/svm_train.java:[557,13] NotImplementedException is internal proprietary API and may be removed in a future release
[INFO] [INFO] 
[INFO] [INFO] --- maven-resources-plugin:2.5:testResources (default-testResources) @ jlibsvm ---
[INFO] [debug] execute contextualize
[INFO] [INFO] Using 'UTF-8' encoding to copy filtered resources.
[INFO] [INFO] Copying 10 resources
[INFO] [INFO] 
[INFO] [INFO] --- maven-compiler-plugin:2.4:testCompile (default-testCompile) @ jlibsvm ---
[INFO] [INFO] Compiling 1 source file to /media/ephemeral0/workspace/jlibsvm/target/test-classes
[INFO] [INFO] 
[INFO] [INFO] --- maven-surefire-plugin:2.12:test (default-test) @ jlibsvm ---
[INFO] [INFO] Surefire report directory: /media/ephemeral0/workspace/jlibsvm/target/surefire-reports
[INFO] 
[INFO] -------------------------------------------------------
[INFO]  T E S T S
[INFO] -------------------------------------------------------
[INFO] Running TestSuite
[INFO] Tests run: 1, Failures: 0, Errors: 0, Skipped: 0, Time elapsed: 2.81 sec
[INFO] 
[INFO] Results :
[INFO] 
[INFO] Tests run: 1, Failures: 0, Errors: 0, Skipped: 0
[INFO] 
[INFO] [INFO] 
[INFO] [INFO] --- maven-jar-plugin:2.4:jar (default-jar) @ jlibsvm ---
[INFO] [INFO] Building jar: /media/ephemeral0/workspace/jlibsvm/target/jlibsvm-0.91.jar
[INFO] [INFO] 
[INFO] [INFO] --- maven-jar-plugin:2.4:test-jar (default) @ jlibsvm ---
[INFO] [INFO] Building jar: /media/ephemeral0/workspace/jlibsvm/target/jlibsvm-0.91-tests.jar
[INFO] [INFO] 
[INFO] [INFO] --- maven-jar-plugin:2.4:jar (default) @ jlibsvm ---
[INFO] [INFO] 
[INFO] [INFO] --- maven-assembly-plugin:2.2-beta-5:single (package) @ jlibsvm ---
[INFO] [INFO] Reading assembly descriptor: src/main/assembly/assembly.xml
[INFO] [INFO] Building tar : /media/ephemeral0/workspace/jlibsvm/target/jlibsvm-0.91-distribution.tar.gz
[INFO] [INFO] 
[INFO] [INFO] --- build-helper-maven-plugin:1.7:attach-artifact (attach-artifacts) @ jlibsvm ---
[INFO] [INFO] ------------------------------------------------------------------------
[INFO] [INFO] BUILD SUCCESS
[INFO] [INFO] ------------------------------------------------------------------------
[INFO] [INFO] Total time: 1:50.982s
[INFO] [INFO] Finished at: Sun Jul 08 01:42:23 UTC 2012
[INFO] [INFO] Final Memory: 16M/38M
[INFO] [INFO] ------------------------------------------------------------------------
mojoFailed org.apache.maven.plugins:maven-release-plugin:2.0(default-cli)
[INFO] Checking in modified POMs...
[INFO] Executing: /bin/sh -c cd /media/ephemeral0/workspace/jlibsvm && svn --non-interactive commit --file /tmp/maven-scm-1188752140.commit --targets /tmp/maven-scm-1336222009780796960-targets
[INFO] Working directory: /media/ephemeral0/workspace/jlibsvm
projectFailed edu.berkeley.compbio:jlibsvm:0.91-SNAPSHOT
sessionEnded
[INFO] ------------------------------------------------------------------------
[INFO] BUILD FAILURE
[INFO] ------------------------------------------------------------------------
[INFO] Total time: 2:30.541s
[INFO] Finished at: Sun Jul 08 01:42:24 UTC 2012
[INFO] Final Memory: 12M/33M
[INFO] ------------------------------------------------------------------------
Projects to build: [MavenProject: edu.berkeley.compbio:jlibsvm:0.91-SNAPSHOT @ /media/ephemeral0/workspace/jlibsvm/pom.xml]
[JENKINS] Archiving /media/ephemeral0/workspace/jlibsvm/pom.xml to /usr/share/apache-tomcat-7.0.22/.jenkins/jobs/jlibsvm/modules/edu.berkeley.compbio$jlibsvm/builds/2012-07-07_21-39-42/archive/edu.berkeley.compbio/jlibsvm/0.91-SNAPSHOT/jlibsvm-0.91-SNAPSHOT.pom
Waiting for Jenkins to finish collecting data
mavenExecutionResult exceptions not empty
message : Failed to execute goal org.apache.maven.plugins:maven-release-plugin:2.0:prepare (default-cli) on project jlibsvm: Unable to commit files
Provider message:
The svn command failed.
Command output:
svn: '/media/ephemeral0/workspace/jlibsvm' is not a working copy

cause : Unable to commit files
Provider message:
The svn command failed.
Command output:
svn: '/media/ephemeral0/workspace/jlibsvm' is not a working copy

Stack trace : 
org.apache.maven.lifecycle.LifecycleExecutionException: Failed to execute goal org.apache.maven.plugins:maven-release-plugin:2.0:prepare (default-cli) on project jlibsvm: Unable to commit files
Provider message:
The svn command failed.
Command output:
svn: '/media/ephemeral0/workspace/jlibsvm' is not a working copy

	at org.apache.maven.lifecycle.internal.MojoExecutor.execute(MojoExecutor.java:213)
	at org.apache.maven.lifecycle.internal.MojoExecutor.execute(MojoExecutor.java:153)
	at org.apache.maven.lifecycle.internal.MojoExecutor.execute(MojoExecutor.java:145)
	at org.apache.maven.lifecycle.internal.LifecycleModuleBuilder.buildProject(LifecycleModuleBuilder.java:84)
	at org.apache.maven.lifecycle.internal.LifecycleModuleBuilder.buildProject(LifecycleModuleBuilder.java:59)
	at org.apache.maven.lifecycle.internal.LifecycleStarter.singleThreadedBuild(LifecycleStarter.java:183)
	at org.apache.maven.lifecycle.internal.LifecycleStarter.execute(LifecycleStarter.java:161)
	at org.apache.maven.DefaultMaven.doExecute(DefaultMaven.java:320)
	at org.apache.maven.DefaultMaven.execute(DefaultMaven.java:156)
	at org.jvnet.hudson.maven3.launcher.Maven3Launcher.main(Maven3Launcher.java:79)
	at sun.reflect.NativeMethodAccessorImpl.invoke0(Native Method)
	at sun.reflect.NativeMethodAccessorImpl.invoke(NativeMethodAccessorImpl.java:57)
	at sun.reflect.DelegatingMethodAccessorImpl.invoke(DelegatingMethodAccessorImpl.java:43)
	at java.lang.reflect.Method.invoke(Method.java:601)
	at org.codehaus.plexus.classworlds.launcher.Launcher.launchStandard(Launcher.java:329)
	at org.codehaus.plexus.classworlds.launcher.Launcher.launch(Launcher.java:239)
	at org.jvnet.hudson.maven3.agent.Maven3Main.launch(Maven3Main.java:158)
	at hudson.maven.Maven3Builder.call(Maven3Builder.java:98)
	at hudson.maven.Maven3Builder.call(Maven3Builder.java:64)
	at hudson.remoting.UserRequest.perform(UserRequest.java:118)
	at hudson.remoting.UserRequest.perform(UserRequest.java:48)
	at hudson.remoting.Request$2.run(Request.java:326)
	at hudson.remoting.InterceptingExecutorService$1.call(InterceptingExecutorService.java:72)
	at java.util.concurrent.FutureTask$Sync.innerRun(FutureTask.java:334)
	at java.util.concurrent.FutureTask.run(FutureTask.java:166)
	at java.util.concurrent.ThreadPoolExecutor.runWorker(ThreadPoolExecutor.java:1110)
	at java.util.concurrent.ThreadPoolExecutor$Worker.run(ThreadPoolExecutor.java:603)
	at java.lang.Thread.run(Thread.java:722)
Caused by: org.apache.maven.plugin.MojoFailureException: Unable to commit files
Provider message:
The svn command failed.
Command output:
svn: '/media/ephemeral0/workspace/jlibsvm' is not a working copy

	at org.apache.maven.plugins.release.PrepareReleaseMojo.prepareRelease(PrepareReleaseMojo.java:219)
	at org.apache.maven.plugins.release.PrepareReleaseMojo.execute(PrepareReleaseMojo.java:181)
	at org.apache.maven.plugin.DefaultBuildPluginManager.executeMojo(DefaultBuildPluginManager.java:101)
	at org.apache.maven.lifecycle.internal.MojoExecutor.execute(MojoExecutor.java:209)
	... 27 more
Caused by: org.apache.maven.shared.release.scm.ReleaseScmCommandException: Unable to commit files
Provider message:
The svn command failed.
Command output:
svn: '/media/ephemeral0/workspace/jlibsvm' is not a working copy

	at org.apache.maven.shared.release.phase.ScmCommitPhase.checkin(ScmCommitPhase.java:133)
	at org.apache.maven.shared.release.phase.ScmCommitPhase.execute(ScmCommitPhase.java:109)
	at org.apache.maven.shared.release.DefaultReleaseManager.prepare(DefaultReleaseManager.java:203)
	at org.apache.maven.shared.release.DefaultReleaseManager.prepare(DefaultReleaseManager.java:140)
	at org.apache.maven.shared.release.DefaultReleaseManager.prepare(DefaultReleaseManager.java:103)
	at org.apache.maven.plugins.release.PrepareReleaseMojo.prepareRelease(PrepareReleaseMojo.java:211)
	... 30 more
channel stopped
Sending e-mails to: dev@davidsoergel.com
Finished: FAILURE