FailedConsole Output

Started by user David Soergel
Building remotely on i-e58d9a9a in workspace /media/ephemeral0/workspace/dsutils
Unpacking http://archive.apache.org/dist/maven/binaries/apache-maven-3.0.4-bin.zip to /media/ephemeral0/tools/Maven/Maven_3.0.4 on i-e58d9a9a
$ hg clone --rev default --noupdate ssh://jenkins@dev.davidsoergel.com//home/hg/dsutils /media/ephemeral0/workspace/dsutils
adding changesets
adding manifests
adding file changes
added 598 changesets with 2184 changes to 387 files
[dsutils] $ hg update --rev default
198 files updated, 0 files merged, 0 files removed, 0 files unresolved
[dsutils] $ hg log --rev . --template {node}
[dsutils] $ hg log --rev . --template {rev}
[dsutils] $ hg log --rev 46aa31e68c20f494b66fa2f62644320b329faadc
[dsutils] $ hg log --template "<changeset node='{node}' author='{author|xmlescape}' rev='{rev}' date='{date}'><msg>{desc|xmlescape}</msg><added>{file_adds|stringify|xmlescape}</added><deleted>{file_dels|stringify|xmlescape}</deleted><files>{files|stringify|xmlescape}</files><parents>{parents}</parents></changeset>\n" --rev default:0 --follow --prune 46aa31e68c20f494b66fa2f62644320b329faadc
Parsing POMs
Downloaded artifact http://dev.davidsoergel.com/nexus/content/groups/public//com/davidsoergel/basepom/1.0/basepom-1.0.pom
[dsutils] $ java -Xmx1024M -XX:MaxPermSize=256M -cp /media/ephemeral0/maven3-agent.jar:/media/ephemeral0/tools/Maven/Maven_3.0.4/boot/plexus-classworlds-2.4.jar org.jvnet.hudson.maven3.agent.Maven3Main /media/ephemeral0/tools/Maven/Maven_3.0.4 /tmp/slave.jar /media/ephemeral0/maven3-interceptor.jar 52825
<===[JENKINS REMOTING CAPACITY]===>channel started
log4j:WARN No appenders could be found for logger (org.apache.commons.beanutils.converters.BooleanConverter).
log4j:WARN Please initialize the log4j system properly.
Executing Maven:  -B -f /media/ephemeral0/workspace/dsutils/pom.xml -U -e clean source:jar package jar:test-jar
[INFO] Error stacktraces are turned on.
Downloading: http://dev.davidsoergel.com/nexus/content/groups/public/org/apache/maven/wagon/wagon-ssh-external/1.0/wagon-ssh-external-1.0.pom
Downloaded: http://dev.davidsoergel.com/nexus/content/groups/public/org/apache/maven/wagon/wagon-ssh-external/1.0/wagon-ssh-external-1.0.pom (3 KB at 4.4 KB/sec)
Downloading: http://dev.davidsoergel.com/nexus/content/groups/public/org/apache/maven/wagon/wagon-providers/1.0/wagon-providers-1.0.pom
[INFO] Scanning for projects...
Downloaded: http://dev.davidsoergel.com/nexus/content/groups/public/org/apache/maven/wagon/wagon-providers/1.0/wagon-providers-1.0.pom (3 KB at 6.1 KB/sec)
Downloading: http://dev.davidsoergel.com/nexus/content/groups/public/org/apache/maven/wagon/wagon/1.0/wagon-1.0.pom
Downloaded: http://dev.davidsoergel.com/nexus/content/groups/public/org/apache/maven/wagon/wagon/1.0/wagon-1.0.pom (10 KB at 62.0 KB/sec)
Downloading: http://dev.davidsoergel.com/nexus/content/groups/public/org/apache/maven/maven-parent/20/maven-parent-20.pom
Downloaded: http://dev.davidsoergel.com/nexus/content/groups/public/org/apache/maven/maven-parent/20/maven-parent-20.pom (25 KB at 42.7 KB/sec)
Downloading: http://dev.davidsoergel.com/nexus/content/groups/public/org/apache/apache/9/apache-9.pom
Downloaded: http://dev.davidsoergel.com/nexus/content/groups/public/org/apache/apache/9/apache-9.pom (15 KB at 50.9 KB/sec)
Downloading: http://dev.davidsoergel.com/nexus/content/groups/public/org/codehaus/plexus/plexus-utils/1.4.2/plexus-utils-1.4.2.pom
Downloaded: http://dev.davidsoergel.com/nexus/content/groups/public/org/codehaus/plexus/plexus-utils/1.4.2/plexus-utils-1.4.2.pom (2 KB at 7.3 KB/sec)
Downloading: http://dev.davidsoergel.com/nexus/content/groups/public/org/codehaus/plexus/plexus/1.0.11/plexus-1.0.11.pom
Downloaded: http://dev.davidsoergel.com/nexus/content/groups/public/org/codehaus/plexus/plexus/1.0.11/plexus-1.0.11.pom (9 KB at 70.6 KB/sec)
Downloading: http://dev.davidsoergel.com/nexus/content/groups/public/org/apache/maven/wagon/wagon-ssh-common/1.0/wagon-ssh-common-1.0.pom
Downloaded: http://dev.davidsoergel.com/nexus/content/groups/public/org/apache/maven/wagon/wagon-ssh-common/1.0/wagon-ssh-common-1.0.pom (2 KB at 16.1 KB/sec)
Downloading: http://dev.davidsoergel.com/nexus/content/groups/public/org/codehaus/plexus/plexus-interactivity-api/1.0-alpha-6/plexus-interactivity-api-1.0-alpha-6.pom
Downloaded: http://dev.davidsoergel.com/nexus/content/groups/public/org/codehaus/plexus/plexus-interactivity-api/1.0-alpha-6/plexus-interactivity-api-1.0-alpha-6.pom (726 B at 8.8 KB/sec)
Downloading: http://dev.davidsoergel.com/nexus/content/groups/public/org/codehaus/plexus/plexus-interactivity/1.0-alpha-6/plexus-interactivity-1.0-alpha-6.pom
Downloaded: http://dev.davidsoergel.com/nexus/content/groups/public/org/codehaus/plexus/plexus-interactivity/1.0-alpha-6/plexus-interactivity-1.0-alpha-6.pom (2 KB at 19.1 KB/sec)
Downloading: http://dev.davidsoergel.com/nexus/content/groups/public/org/codehaus/plexus/plexus-components/1.1.9/plexus-components-1.1.9.pom
Downloaded: http://dev.davidsoergel.com/nexus/content/groups/public/org/codehaus/plexus/plexus-components/1.1.9/plexus-components-1.1.9.pom (3 KB at 84.7 KB/sec)
Downloading: http://dev.davidsoergel.com/nexus/content/groups/public/org/codehaus/plexus/plexus/1.0.10/plexus-1.0.10.pom
Downloaded: http://dev.davidsoergel.com/nexus/content/groups/public/org/codehaus/plexus/plexus/1.0.10/plexus-1.0.10.pom (9 KB at 212.0 KB/sec)
Downloading: http://dev.davidsoergel.com/nexus/content/groups/public/org/apache/maven/wagon/wagon-provider-api/1.0/wagon-provider-api-1.0.pom
Downloaded: http://dev.davidsoergel.com/nexus/content/groups/public/org/apache/maven/wagon/wagon-provider-api/1.0/wagon-provider-api-1.0.pom (2 KB at 15.4 KB/sec)
Downloading: http://dev.davidsoergel.com/nexus/content/groups/public/org/apache/maven/wagon/wagon-ssh-external/1.0/wagon-ssh-external-1.0.jar
Downloading: http://dev.davidsoergel.com/nexus/content/groups/public/org/codehaus/plexus/plexus-utils/1.4.2/plexus-utils-1.4.2.jar
Downloading: http://dev.davidsoergel.com/nexus/content/groups/public/org/apache/maven/wagon/wagon-ssh-common/1.0/wagon-ssh-common-1.0.jar
Downloading: http://dev.davidsoergel.com/nexus/content/groups/public/org/codehaus/plexus/plexus-interactivity-api/1.0-alpha-6/plexus-interactivity-api-1.0-alpha-6.jar
Downloaded: http://dev.davidsoergel.com/nexus/content/groups/public/org/codehaus/plexus/plexus-interactivity-api/1.0-alpha-6/plexus-interactivity-api-1.0-alpha-6.jar (12 KB at 36.8 KB/sec)
Downloaded: http://dev.davidsoergel.com/nexus/content/groups/public/org/apache/maven/wagon/wagon-ssh-external/1.0/wagon-ssh-external-1.0.jar (15 KB at 28.7 KB/sec)
Downloaded: http://dev.davidsoergel.com/nexus/content/groups/public/org/apache/maven/wagon/wagon-ssh-common/1.0/wagon-ssh-common-1.0.jar (26 KB at 52.7 KB/sec)
Downloaded: http://dev.davidsoergel.com/nexus/content/groups/public/org/codehaus/plexus/plexus-utils/1.4.2/plexus-utils-1.4.2.jar (186 KB at 221.0 KB/sec)
Downloading: http://dev.davidsoergel.com/nexus/content/groups/public/org/apache/maven/wagon/wagon-webdav/1.0-beta-2/wagon-webdav-1.0-beta-2.pom
Downloaded: http://dev.davidsoergel.com/nexus/content/groups/public/org/apache/maven/wagon/wagon-webdav/1.0-beta-2/wagon-webdav-1.0-beta-2.pom (2 KB at 19.8 KB/sec)
Downloading: http://dev.davidsoergel.com/nexus/content/groups/public/org/apache/maven/wagon/wagon-providers/1.0-beta-2/wagon-providers-1.0-beta-2.pom
Downloaded: http://dev.davidsoergel.com/nexus/content/groups/public/org/apache/maven/wagon/wagon-providers/1.0-beta-2/wagon-providers-1.0-beta-2.pom (2 KB at 32.1 KB/sec)
Downloading: http://dev.davidsoergel.com/nexus/content/groups/public/org/apache/maven/wagon/wagon/1.0-beta-2/wagon-1.0-beta-2.pom
Downloaded: http://dev.davidsoergel.com/nexus/content/groups/public/org/apache/maven/wagon/wagon/1.0-beta-2/wagon-1.0-beta-2.pom (6 KB at 117.2 KB/sec)
Downloading: http://dev.davidsoergel.com/nexus/content/groups/public/org/apache/maven/maven-parent/4/maven-parent-4.pom
Downloaded: http://dev.davidsoergel.com/nexus/content/groups/public/org/apache/maven/maven-parent/4/maven-parent-4.pom (10 KB at 180.8 KB/sec)
Downloading: http://dev.davidsoergel.com/nexus/content/groups/public/org/apache/apache/3/apache-3.pom
Downloaded: http://dev.davidsoergel.com/nexus/content/groups/public/org/apache/apache/3/apache-3.pom (4 KB at 108.1 KB/sec)
Downloading: http://dev.davidsoergel.com/nexus/content/groups/public/slide/slide-webdavlib/2.1/slide-webdavlib-2.1.pom
Downloaded: http://dev.davidsoergel.com/nexus/content/groups/public/slide/slide-webdavlib/2.1/slide-webdavlib-2.1.pom (648 B at 7.6 KB/sec)
Downloading: http://dev.davidsoergel.com/nexus/content/groups/public/commons-httpclient/commons-httpclient/2.0.2/commons-httpclient-2.0.2.pom
Downloaded: http://dev.davidsoergel.com/nexus/content/groups/public/commons-httpclient/commons-httpclient/2.0.2/commons-httpclient-2.0.2.pom (7 KB at 168.6 KB/sec)
Downloading: http://dev.davidsoergel.com/nexus/content/groups/public/commons-logging/commons-logging/1.0.3/commons-logging-1.0.3.pom
Downloaded: http://dev.davidsoergel.com/nexus/content/groups/public/commons-logging/commons-logging/1.0.3/commons-logging-1.0.3.pom (866 B at 9.4 KB/sec)
Downloading: http://dev.davidsoergel.com/nexus/content/groups/public/jdom/jdom/1.0/jdom-1.0.pom
Downloaded: http://dev.davidsoergel.com/nexus/content/groups/public/jdom/jdom/1.0/jdom-1.0.pom (2 KB at 7.9 KB/sec)
Downloading: http://dev.davidsoergel.com/nexus/content/groups/public/de/zeigermann/xml/xml-im-exporter/1.1/xml-im-exporter-1.1.pom
Downloaded: http://dev.davidsoergel.com/nexus/content/groups/public/de/zeigermann/xml/xml-im-exporter/1.1/xml-im-exporter-1.1.pom (248 B at 1.9 KB/sec)
Downloading: http://dev.davidsoergel.com/nexus/content/groups/public/commons-logging/commons-logging/1.0.4/commons-logging-1.0.4.pom
Downloaded: http://dev.davidsoergel.com/nexus/content/groups/public/commons-logging/commons-logging/1.0.4/commons-logging-1.0.4.pom (6 KB at 59.8 KB/sec)
Downloading: http://dev.davidsoergel.com/nexus/content/groups/public/org/apache/maven/wagon/wagon-provider-api/1.0-beta-2/wagon-provider-api-1.0-beta-2.pom
Downloaded: http://dev.davidsoergel.com/nexus/content/groups/public/org/apache/maven/wagon/wagon-provider-api/1.0-beta-2/wagon-provider-api-1.0-beta-2.pom (680 B at 5.9 KB/sec)
Downloading: http://dev.davidsoergel.com/nexus/content/groups/public/org/codehaus/plexus/plexus-utils/1.0.4/plexus-utils-1.0.4.pom
Downloaded: http://dev.davidsoergel.com/nexus/content/groups/public/org/codehaus/plexus/plexus-utils/1.0.4/plexus-utils-1.0.4.pom (7 KB at 54.0 KB/sec)
Downloading: http://dev.davidsoergel.com/nexus/content/groups/public/org/apache/maven/wagon/wagon-webdav/1.0-beta-2/wagon-webdav-1.0-beta-2.jar
Downloading: http://dev.davidsoergel.com/nexus/content/groups/public/commons-httpclient/commons-httpclient/2.0.2/commons-httpclient-2.0.2.jar
Downloading: http://dev.davidsoergel.com/nexus/content/groups/public/jdom/jdom/1.0/jdom-1.0.jar
Downloading: http://dev.davidsoergel.com/nexus/content/groups/public/slide/slide-webdavlib/2.1/slide-webdavlib-2.1.jar
Downloading: http://dev.davidsoergel.com/nexus/content/groups/public/de/zeigermann/xml/xml-im-exporter/1.1/xml-im-exporter-1.1.jar
Downloaded: http://dev.davidsoergel.com/nexus/content/groups/public/org/apache/maven/wagon/wagon-webdav/1.0-beta-2/wagon-webdav-1.0-beta-2.jar (17 KB at 114.9 KB/sec)
Downloading: http://dev.davidsoergel.com/nexus/content/groups/public/commons-logging/commons-logging/1.0.4/commons-logging-1.0.4.jar
Downloaded: http://dev.davidsoergel.com/nexus/content/groups/public/de/zeigermann/xml/xml-im-exporter/1.1/xml-im-exporter-1.1.jar (24 KB at 107.8 KB/sec)
Downloading: http://dev.davidsoergel.com/nexus/content/groups/public/org/codehaus/plexus/plexus-utils/1.0.4/plexus-utils-1.0.4.jar
Downloaded: http://dev.davidsoergel.com/nexus/content/groups/public/commons-logging/commons-logging/1.0.4/commons-logging-1.0.4.jar (38 KB at 314.6 KB/sec)
Downloaded: http://dev.davidsoergel.com/nexus/content/groups/public/commons-httpclient/commons-httpclient/2.0.2/commons-httpclient-2.0.2.jar (221 KB at 407.6 KB/sec)
Downloaded: http://dev.davidsoergel.com/nexus/content/groups/public/jdom/jdom/1.0/jdom-1.0.jar (150 KB at 277.7 KB/sec)
Downloaded: http://dev.davidsoergel.com/nexus/content/groups/public/org/codehaus/plexus/plexus-utils/1.0.4/plexus-utils-1.0.4.jar (160 KB at 504.6 KB/sec)
Downloaded: http://dev.davidsoergel.com/nexus/content/groups/public/slide/slide-webdavlib/2.1/slide-webdavlib-2.1.jar (169 KB at 276.5 KB/sec)
Projects to build: [MavenProject: com.davidsoergel:dsutils:1.06-SNAPSHOT @ /media/ephemeral0/workspace/dsutils/pom.xml]
Downloading: http://dev.davidsoergel.com/nexus/content/groups/public/org/apache/maven/plugins/maven-compiler-plugin/2.4/maven-compiler-plugin-2.4.pom
Downloaded: http://dev.davidsoergel.com/nexus/content/groups/public/org/apache/maven/plugins/maven-compiler-plugin/2.4/maven-compiler-plugin-2.4.pom (7 KB at 240.3 KB/sec)
Downloading: http://dev.davidsoergel.com/nexus/content/groups/public/org/apache/maven/plugins/maven-plugins/22/maven-plugins-22.pom
Downloaded: http://dev.davidsoergel.com/nexus/content/groups/public/org/apache/maven/plugins/maven-plugins/22/maven-plugins-22.pom (13 KB at 235.8 KB/sec)
Downloading: http://dev.davidsoergel.com/nexus/content/groups/public/org/apache/maven/maven-parent/21/maven-parent-21.pom
Downloaded: http://dev.davidsoergel.com/nexus/content/groups/public/org/apache/maven/maven-parent/21/maven-parent-21.pom (26 KB at 780.0 KB/sec)
Downloading: http://dev.davidsoergel.com/nexus/content/groups/public/org/apache/apache/10/apache-10.pom
Downloaded: http://dev.davidsoergel.com/nexus/content/groups/public/org/apache/apache/10/apache-10.pom (15 KB at 212.5 KB/sec)
Downloading: http://dev.davidsoergel.com/nexus/content/groups/public/org/apache/maven/plugins/maven-compiler-plugin/2.4/maven-compiler-plugin-2.4.jar
Downloaded: http://dev.davidsoergel.com/nexus/content/groups/public/org/apache/maven/plugins/maven-compiler-plugin/2.4/maven-compiler-plugin-2.4.jar (30 KB at 127.9 KB/sec)
Downloading: http://dev.davidsoergel.com/nexus/content/groups/public/org/apache/maven/plugins/maven-jar-plugin/2.4/maven-jar-plugin-2.4.pom
Downloaded: http://dev.davidsoergel.com/nexus/content/groups/public/org/apache/maven/plugins/maven-jar-plugin/2.4/maven-jar-plugin-2.4.pom (6 KB at 26.3 KB/sec)
Downloading: http://dev.davidsoergel.com/nexus/content/groups/public/org/apache/maven/plugins/maven-jar-plugin/2.4/maven-jar-plugin-2.4.jar
Downloaded: http://dev.davidsoergel.com/nexus/content/groups/public/org/apache/maven/plugins/maven-jar-plugin/2.4/maven-jar-plugin-2.4.jar (34 KB at 149.7 KB/sec)
Downloading: http://dev.davidsoergel.com/nexus/content/groups/public/org/apache/maven/plugins/maven-surefire-plugin/2.12/maven-surefire-plugin-2.12.pom
Downloaded: http://dev.davidsoergel.com/nexus/content/groups/public/org/apache/maven/plugins/maven-surefire-plugin/2.12/maven-surefire-plugin-2.12.pom (10 KB at 364.5 KB/sec)
Downloading: http://dev.davidsoergel.com/nexus/content/groups/public/org/apache/maven/surefire/surefire/2.12/surefire-2.12.pom
Downloaded: http://dev.davidsoergel.com/nexus/content/groups/public/org/apache/maven/surefire/surefire/2.12/surefire-2.12.pom (11 KB at 218.8 KB/sec)
Downloading: http://dev.davidsoergel.com/nexus/content/groups/public/org/apache/maven/plugins/maven-surefire-plugin/2.12/maven-surefire-plugin-2.12.jar
Downloaded: http://dev.davidsoergel.com/nexus/content/groups/public/org/apache/maven/plugins/maven-surefire-plugin/2.12/maven-surefire-plugin-2.12.jar (31 KB at 602.7 KB/sec)
Downloading: http://dev.davidsoergel.com/nexus/content/groups/public/org/codehaus/mojo/cobertura-maven-plugin/2.5.1/cobertura-maven-plugin-2.5.1.pom
Downloaded: http://dev.davidsoergel.com/nexus/content/groups/public/org/codehaus/mojo/cobertura-maven-plugin/2.5.1/cobertura-maven-plugin-2.5.1.pom (10 KB at 226.3 KB/sec)
Downloading: http://dev.davidsoergel.com/nexus/content/groups/public/org/codehaus/mojo/mojo-parent/28/mojo-parent-28.pom
Downloaded: http://dev.davidsoergel.com/nexus/content/groups/public/org/codehaus/mojo/mojo-parent/28/mojo-parent-28.pom (26 KB at 286.7 KB/sec)
Downloading: http://dev.davidsoergel.com/nexus/content/groups/public/org/codehaus/codehaus-parent/3/codehaus-parent-3.pom
Downloaded: http://dev.davidsoergel.com/nexus/content/groups/public/org/codehaus/codehaus-parent/3/codehaus-parent-3.pom (5 KB at 71.6 KB/sec)
Downloading: http://dev.davidsoergel.com/nexus/content/groups/public/org/codehaus/mojo/cobertura-maven-plugin/2.5.1/cobertura-maven-plugin-2.5.1.jar
Downloaded: http://dev.davidsoergel.com/nexus/content/groups/public/org/codehaus/mojo/cobertura-maven-plugin/2.5.1/cobertura-maven-plugin-2.5.1.jar (47 KB at 362.3 KB/sec)
Downloading: http://dev.davidsoergel.com/nexus/content/groups/public/org/apache/maven/plugins/maven-clean-plugin/2.4.1/maven-clean-plugin-2.4.1.pom
Downloaded: http://dev.davidsoergel.com/nexus/content/groups/public/org/apache/maven/plugins/maven-clean-plugin/2.4.1/maven-clean-plugin-2.4.1.pom (5 KB at 47.8 KB/sec)
Downloading: http://dev.davidsoergel.com/nexus/content/groups/public/org/apache/maven/plugins/maven-plugins/18/maven-plugins-18.pom
Downloaded: http://dev.davidsoergel.com/nexus/content/groups/public/org/apache/maven/plugins/maven-plugins/18/maven-plugins-18.pom (13 KB at 270.1 KB/sec)
Downloading: http://dev.davidsoergel.com/nexus/content/groups/public/org/apache/maven/maven-parent/16/maven-parent-16.pom
Downloaded: http://dev.davidsoergel.com/nexus/content/groups/public/org/apache/maven/maven-parent/16/maven-parent-16.pom (23 KB at 169.6 KB/sec)
Downloading: http://dev.davidsoergel.com/nexus/content/groups/public/org/apache/apache/7/apache-7.pom
Downloaded: http://dev.davidsoergel.com/nexus/content/groups/public/org/apache/apache/7/apache-7.pom (15 KB at 114.6 KB/sec)
Downloading: http://dev.davidsoergel.com/nexus/content/groups/public/org/apache/maven/plugins/maven-clean-plugin/2.4.1/maven-clean-plugin-2.4.1.jar
Downloaded: http://dev.davidsoergel.com/nexus/content/groups/public/org/apache/maven/plugins/maven-clean-plugin/2.4.1/maven-clean-plugin-2.4.1.jar (23 KB at 232.3 KB/sec)
Downloading: http://dev.davidsoergel.com/nexus/content/groups/public/org/apache/maven/plugins/maven-install-plugin/2.3.1/maven-install-plugin-2.3.1.pom
Downloaded: http://dev.davidsoergel.com/nexus/content/groups/public/org/apache/maven/plugins/maven-install-plugin/2.3.1/maven-install-plugin-2.3.1.pom (5 KB at 54.2 KB/sec)
Downloading: http://dev.davidsoergel.com/nexus/content/groups/public/org/apache/maven/plugins/maven-install-plugin/2.3.1/maven-install-plugin-2.3.1.jar
Downloaded: http://dev.davidsoergel.com/nexus/content/groups/public/org/apache/maven/plugins/maven-install-plugin/2.3.1/maven-install-plugin-2.3.1.jar (23 KB at 65.0 KB/sec)
Downloading: http://dev.davidsoergel.com/nexus/content/groups/public/org/apache/maven/plugins/maven-resources-plugin/2.5/maven-resources-plugin-2.5.pom
Downloaded: http://dev.davidsoergel.com/nexus/content/groups/public/org/apache/maven/plugins/maven-resources-plugin/2.5/maven-resources-plugin-2.5.pom (7 KB at 19.4 KB/sec)
Downloading: http://dev.davidsoergel.com/nexus/content/groups/public/org/apache/maven/plugins/maven-plugins/19/maven-plugins-19.pom
Downloaded: http://dev.davidsoergel.com/nexus/content/groups/public/org/apache/maven/plugins/maven-plugins/19/maven-plugins-19.pom (11 KB at 62.1 KB/sec)
Downloading: http://dev.davidsoergel.com/nexus/content/groups/public/org/apache/maven/maven-parent/19/maven-parent-19.pom
Downloaded: http://dev.davidsoergel.com/nexus/content/groups/public/org/apache/maven/maven-parent/19/maven-parent-19.pom (25 KB at 259.8 KB/sec)
Downloading: http://dev.davidsoergel.com/nexus/content/groups/public/org/apache/maven/plugins/maven-resources-plugin/2.5/maven-resources-plugin-2.5.jar
Downloaded: http://dev.davidsoergel.com/nexus/content/groups/public/org/apache/maven/plugins/maven-resources-plugin/2.5/maven-resources-plugin-2.5.jar (26 KB at 209.4 KB/sec)
Downloading: http://dev.davidsoergel.com/nexus/content/groups/public/org/apache/maven/plugins/maven-deploy-plugin/2.7/maven-deploy-plugin-2.7.pom
Downloaded: http://dev.davidsoergel.com/nexus/content/groups/public/org/apache/maven/plugins/maven-deploy-plugin/2.7/maven-deploy-plugin-2.7.pom (6 KB at 103.4 KB/sec)
Downloading: http://dev.davidsoergel.com/nexus/content/groups/public/org/apache/maven/plugins/maven-deploy-plugin/2.7/maven-deploy-plugin-2.7.jar
Downloaded: http://dev.davidsoergel.com/nexus/content/groups/public/org/apache/maven/plugins/maven-deploy-plugin/2.7/maven-deploy-plugin-2.7.jar (27 KB at 213.0 KB/sec)
Downloading: http://dev.davidsoergel.com/nexus/content/groups/public/org/apache/maven/plugins/maven-site-plugin/3.1/maven-site-plugin-3.1.pom
Downloaded: http://dev.davidsoergel.com/nexus/content/groups/public/org/apache/maven/plugins/maven-site-plugin/3.1/maven-site-plugin-3.1.pom (18 KB at 148.5 KB/sec)
Downloading: http://dev.davidsoergel.com/nexus/content/groups/public/org/apache/maven/plugins/maven-site-plugin/3.1/maven-site-plugin-3.1.jar
Downloaded: http://dev.davidsoergel.com/nexus/content/groups/public/org/apache/maven/plugins/maven-site-plugin/3.1/maven-site-plugin-3.1.jar (117 KB at 450.8 KB/sec)
Downloading: http://dev.davidsoergel.com/nexus/content/groups/public/org/apache/maven/plugins/maven-antrun-plugin/1.3/maven-antrun-plugin-1.3.pom
Downloaded: http://dev.davidsoergel.com/nexus/content/groups/public/org/apache/maven/plugins/maven-antrun-plugin/1.3/maven-antrun-plugin-1.3.pom (5 KB at 6.3 KB/sec)
Downloading: http://dev.davidsoergel.com/nexus/content/groups/public/org/apache/maven/plugins/maven-plugins/12/maven-plugins-12.pom
Downloaded: http://dev.davidsoergel.com/nexus/content/groups/public/org/apache/maven/plugins/maven-plugins/12/maven-plugins-12.pom (12 KB at 43.3 KB/sec)
Downloading: http://dev.davidsoergel.com/nexus/content/groups/public/org/apache/maven/maven-parent/9/maven-parent-9.pom
Downloaded: http://dev.davidsoergel.com/nexus/content/groups/public/org/apache/maven/maven-parent/9/maven-parent-9.pom (33 KB at 4.2 KB/sec)
Downloading: http://dev.davidsoergel.com/nexus/content/groups/public/org/apache/apache/4/apache-4.pom
Downloaded: http://dev.davidsoergel.com/nexus/content/groups/public/org/apache/apache/4/apache-4.pom (5 KB at 51.6 KB/sec)
Downloading: http://dev.davidsoergel.com/nexus/content/groups/public/org/apache/maven/plugins/maven-antrun-plugin/1.3/maven-antrun-plugin-1.3.jar
Downloaded: http://dev.davidsoergel.com/nexus/content/groups/public/org/apache/maven/plugins/maven-antrun-plugin/1.3/maven-antrun-plugin-1.3.jar (24 KB at 605.8 KB/sec)
Downloading: http://dev.davidsoergel.com/nexus/content/groups/public/org/apache/maven/plugins/maven-assembly-plugin/2.2-beta-5/maven-assembly-plugin-2.2-beta-5.pom
Downloaded: http://dev.davidsoergel.com/nexus/content/groups/public/org/apache/maven/plugins/maven-assembly-plugin/2.2-beta-5/maven-assembly-plugin-2.2-beta-5.pom (15 KB at 528.7 KB/sec)
Downloading: http://dev.davidsoergel.com/nexus/content/groups/public/org/apache/maven/plugins/maven-plugins/16/maven-plugins-16.pom
Downloaded: http://dev.davidsoergel.com/nexus/content/groups/public/org/apache/maven/plugins/maven-plugins/16/maven-plugins-16.pom (13 KB at 436.1 KB/sec)
Downloading: http://dev.davidsoergel.com/nexus/content/groups/public/org/apache/maven/maven-parent/15/maven-parent-15.pom
Downloaded: http://dev.davidsoergel.com/nexus/content/groups/public/org/apache/maven/maven-parent/15/maven-parent-15.pom (24 KB at 756.1 KB/sec)
Downloading: http://dev.davidsoergel.com/nexus/content/groups/public/org/apache/apache/6/apache-6.pom
Downloaded: http://dev.davidsoergel.com/nexus/content/groups/public/org/apache/apache/6/apache-6.pom (13 KB at 347.1 KB/sec)
Downloading: http://dev.davidsoergel.com/nexus/content/groups/public/org/apache/maven/plugins/maven-assembly-plugin/2.2-beta-5/maven-assembly-plugin-2.2-beta-5.jar
Downloaded: http://dev.davidsoergel.com/nexus/content/groups/public/org/apache/maven/plugins/maven-assembly-plugin/2.2-beta-5/maven-assembly-plugin-2.2-beta-5.jar (204 KB at 272.3 KB/sec)
Downloading: http://dev.davidsoergel.com/nexus/content/groups/public/org/apache/maven/plugins/maven-dependency-plugin/2.1/maven-dependency-plugin-2.1.pom
Downloaded: http://dev.davidsoergel.com/nexus/content/groups/public/org/apache/maven/plugins/maven-dependency-plugin/2.1/maven-dependency-plugin-2.1.pom (8 KB at 283.9 KB/sec)
Downloading: http://dev.davidsoergel.com/nexus/content/groups/public/org/apache/maven/plugins/maven-dependency-plugin/2.1/maven-dependency-plugin-2.1.jar
Downloaded: http://dev.davidsoergel.com/nexus/content/groups/public/org/apache/maven/plugins/maven-dependency-plugin/2.1/maven-dependency-plugin-2.1.jar (104 KB at 2726.3 KB/sec)
Downloading: http://dev.davidsoergel.com/nexus/content/groups/public/org/apache/maven/plugins/maven-release-plugin/2.0/maven-release-plugin-2.0.pom
Downloaded: http://dev.davidsoergel.com/nexus/content/groups/public/org/apache/maven/plugins/maven-release-plugin/2.0/maven-release-plugin-2.0.pom (8 KB at 86.7 KB/sec)
Downloading: http://dev.davidsoergel.com/nexus/content/groups/public/org/apache/maven/release/maven-release/2.0/maven-release-2.0.pom
Downloaded: http://dev.davidsoergel.com/nexus/content/groups/public/org/apache/maven/release/maven-release/2.0/maven-release-2.0.pom (7 KB at 248.1 KB/sec)
Downloading: http://dev.davidsoergel.com/nexus/content/groups/public/org/apache/maven/plugins/maven-release-plugin/2.0/maven-release-plugin-2.0.jar
Downloaded: http://dev.davidsoergel.com/nexus/content/groups/public/org/apache/maven/plugins/maven-release-plugin/2.0/maven-release-plugin-2.0.jar (38 KB at 752.1 KB/sec)
Downloading: http://dev.davidsoergel.com/nexus/content/groups/public/org/apache/maven/plugins/maven-metadata.xml
Downloading: http://repo.maven.apache.org/maven2/org/apache/maven/plugins/maven-metadata.xml
Downloading: http://dev.davidsoergel.com/nexus/content/groups/public/org/codehaus/mojo/maven-metadata.xml
Downloading: http://repo.maven.apache.org/maven2/org/codehaus/mojo/maven-metadata.xml
Downloaded: http://repo.maven.apache.org/maven2/org/apache/maven/plugins/maven-metadata.xml (11 KB at 54.0 KB/sec)
Downloaded: http://repo.maven.apache.org/maven2/org/codehaus/mojo/maven-metadata.xml (21 KB at 61.3 KB/sec)
Downloaded: http://dev.davidsoergel.com/nexus/content/groups/public/org/apache/maven/plugins/maven-metadata.xml (11 KB at 16.7 KB/sec)
Downloaded: http://dev.davidsoergel.com/nexus/content/groups/public/org/codehaus/mojo/maven-metadata.xml (21 KB at 32.7 KB/sec)
Downloading: http://repo.maven.apache.org/maven2/org/apache/maven/plugins/maven-source-plugin/maven-metadata.xml
Downloading: http://dev.davidsoergel.com/nexus/content/groups/public/org/apache/maven/plugins/maven-source-plugin/maven-metadata.xml
Downloaded: http://dev.davidsoergel.com/nexus/content/groups/public/org/apache/maven/plugins/maven-source-plugin/maven-metadata.xml (692 B at 8.2 KB/sec)
Downloaded: http://repo.maven.apache.org/maven2/org/apache/maven/plugins/maven-source-plugin/maven-metadata.xml (692 B at 6.7 KB/sec)
Downloading: http://dev.davidsoergel.com/nexus/content/groups/public/org/apache/maven/plugins/maven-source-plugin/2.2.1/maven-source-plugin-2.2.1.pom
Downloaded: http://dev.davidsoergel.com/nexus/content/groups/public/org/apache/maven/plugins/maven-source-plugin/2.2.1/maven-source-plugin-2.2.1.pom (7 KB at 232.7 KB/sec)
Downloading: http://dev.davidsoergel.com/nexus/content/groups/public/org/apache/maven/plugins/maven-plugins/23/maven-plugins-23.pom
Downloaded: http://dev.davidsoergel.com/nexus/content/groups/public/org/apache/maven/plugins/maven-plugins/23/maven-plugins-23.pom (9 KB at 116.7 KB/sec)
Downloading: http://dev.davidsoergel.com/nexus/content/groups/public/org/apache/maven/maven-parent/22/maven-parent-22.pom
Downloaded: http://dev.davidsoergel.com/nexus/content/groups/public/org/apache/maven/maven-parent/22/maven-parent-22.pom (30 KB at 246.2 KB/sec)
Downloading: http://dev.davidsoergel.com/nexus/content/groups/public/org/apache/apache/11/apache-11.pom
Downloaded: http://dev.davidsoergel.com/nexus/content/groups/public/org/apache/apache/11/apache-11.pom (15 KB at 498.8 KB/sec)
Downloading: http://dev.davidsoergel.com/nexus/content/groups/public/org/apache/maven/plugins/maven-source-plugin/2.2.1/maven-source-plugin-2.2.1.jar
Downloaded: http://dev.davidsoergel.com/nexus/content/groups/public/org/apache/maven/plugins/maven-source-plugin/2.2.1/maven-source-plugin-2.2.1.jar (30 KB at 945.8 KB/sec)
projectStarted com.davidsoergel:dsutils:1.06-SNAPSHOT
[INFO]                                                                         
[INFO] ------------------------------------------------------------------------
[INFO] Building dsutils 1.06-SNAPSHOT
[INFO] ------------------------------------------------------------------------
Downloading: http://dev.davidsoergel.com/nexus/content/groups/public/commons-lang/commons-lang/2.6/commons-lang-2.6.pom
Downloaded: http://dev.davidsoergel.com/nexus/content/groups/public/commons-lang/commons-lang/2.6/commons-lang-2.6.pom (18 KB at 170.8 KB/sec)
Downloading: http://dev.davidsoergel.com/nexus/content/groups/public/org/apache/commons/commons-parent/17/commons-parent-17.pom
Downloaded: http://dev.davidsoergel.com/nexus/content/groups/public/org/apache/commons/commons-parent/17/commons-parent-17.pom (31 KB at 115.8 KB/sec)
Downloading: http://dev.davidsoergel.com/nexus/content/groups/public/commons-logging/commons-logging/1.1.1/commons-logging-1.1.1.pom
Downloaded: http://dev.davidsoergel.com/nexus/content/groups/public/commons-logging/commons-logging/1.1.1/commons-logging-1.1.1.pom (18 KB at 108.0 KB/sec)
Downloading: http://dev.davidsoergel.com/nexus/content/groups/public/org/apache/commons/commons-parent/5/commons-parent-5.pom
Downloaded: http://dev.davidsoergel.com/nexus/content/groups/public/org/apache/commons/commons-parent/5/commons-parent-5.pom (16 KB at 72.2 KB/sec)
Downloading: http://dev.davidsoergel.com/nexus/content/groups/public/net/sourceforge/collections/collections-generic/4.01/collections-generic-4.01.pom
Downloaded: http://dev.davidsoergel.com/nexus/content/groups/public/net/sourceforge/collections/collections-generic/4.01/collections-generic-4.01.pom (585 B at 2.2 KB/sec)
Downloading: http://dev.davidsoergel.com/nexus/content/groups/public/com/google/collections/google-collections/1.0/google-collections-1.0.pom
Downloaded: http://dev.davidsoergel.com/nexus/content/groups/public/com/google/collections/google-collections/1.0/google-collections-1.0.pom (3 KB at 21.2 KB/sec)
Downloading: http://dev.davidsoergel.com/nexus/content/groups/public/com/google/google/1/google-1.pom
Downloaded: http://dev.davidsoergel.com/nexus/content/groups/public/com/google/google/1/google-1.pom (2 KB at 7.1 KB/sec)
Downloading: http://dev.davidsoergel.com/nexus/content/groups/public/org/testng/testng/5.14.10/testng-5.14.10.pom
Downloaded: http://dev.davidsoergel.com/nexus/content/groups/public/org/testng/testng/5.14.10/testng-5.14.10.pom (7 KB at 275.7 KB/sec)
Downloading: http://dev.davidsoergel.com/nexus/content/groups/public/org/sonatype/oss/oss-parent/3/oss-parent-3.pom
Downloaded: http://dev.davidsoergel.com/nexus/content/groups/public/org/sonatype/oss/oss-parent/3/oss-parent-3.pom (4 KB at 121.2 KB/sec)
Downloading: http://dev.davidsoergel.com/nexus/content/groups/public/junit/junit/3.8.1/junit-3.8.1.pom
Downloaded: http://dev.davidsoergel.com/nexus/content/groups/public/junit/junit/3.8.1/junit-3.8.1.pom (998 B at 8.1 KB/sec)
Downloading: http://dev.davidsoergel.com/nexus/content/groups/public/org/beanshell/bsh/2.0b4/bsh-2.0b4.pom
Downloaded: http://dev.davidsoergel.com/nexus/content/groups/public/org/beanshell/bsh/2.0b4/bsh-2.0b4.pom (2 KB at 7.5 KB/sec)
Downloading: http://dev.davidsoergel.com/nexus/content/groups/public/org/beanshell/beanshell/2.0b4/beanshell-2.0b4.pom
Downloaded: http://dev.davidsoergel.com/nexus/content/groups/public/org/beanshell/beanshell/2.0b4/beanshell-2.0b4.pom (2 KB at 6.6 KB/sec)
Downloading: http://dev.davidsoergel.com/nexus/content/groups/public/com/beust/jcommander/1.12/jcommander-1.12.pom
Downloaded: http://dev.davidsoergel.com/nexus/content/groups/public/com/beust/jcommander/1.12/jcommander-1.12.pom (8 KB at 19.7 KB/sec)
Downloading: http://dev.davidsoergel.com/nexus/content/groups/public/org/yaml/snakeyaml/1.6/snakeyaml-1.6.pom
Downloaded: http://dev.davidsoergel.com/nexus/content/groups/public/org/yaml/snakeyaml/1.6/snakeyaml-1.6.pom (8 KB at 109.3 KB/sec)
Downloading: http://dev.davidsoergel.com/nexus/content/groups/public/org/slf4j/slf4j-log4j12/1.6.4/slf4j-log4j12-1.6.4.pom
Downloaded: http://dev.davidsoergel.com/nexus/content/groups/public/org/slf4j/slf4j-log4j12/1.6.4/slf4j-log4j12-1.6.4.pom (2 KB at 48.9 KB/sec)
Downloading: http://dev.davidsoergel.com/nexus/content/groups/public/org/slf4j/slf4j-parent/1.6.4/slf4j-parent-1.6.4.pom
Downloaded: http://dev.davidsoergel.com/nexus/content/groups/public/org/slf4j/slf4j-parent/1.6.4/slf4j-parent-1.6.4.pom (12 KB at 100.1 KB/sec)
Downloading: http://dev.davidsoergel.com/nexus/content/groups/public/org/slf4j/slf4j-api/1.6.4/slf4j-api-1.6.4.pom
Downloaded: http://dev.davidsoergel.com/nexus/content/groups/public/org/slf4j/slf4j-api/1.6.4/slf4j-api-1.6.4.pom (3 KB at 47.7 KB/sec)
Downloading: http://dev.davidsoergel.com/nexus/content/groups/public/log4j/log4j/1.2.16/log4j-1.2.16.pom
Downloaded: http://dev.davidsoergel.com/nexus/content/groups/public/log4j/log4j/1.2.16/log4j-1.2.16.pom (20 KB at 283.8 KB/sec)
Downloading: http://dev.davidsoergel.com/nexus/content/groups/public/com/intellij/annotations/7.0.3/annotations-7.0.3.pom
Downloaded: http://dev.davidsoergel.com/nexus/content/groups/public/com/intellij/annotations/7.0.3/annotations-7.0.3.pom (2 KB at 19.0 KB/sec)
Downloading: http://dev.davidsoergel.com/nexus/content/groups/public/commons-lang/commons-lang/2.6/commons-lang-2.6.jar
Downloading: http://dev.davidsoergel.com/nexus/content/groups/public/commons-logging/commons-logging/1.1.1/commons-logging-1.1.1.jar
Downloading: http://dev.davidsoergel.com/nexus/content/groups/public/net/sourceforge/collections/collections-generic/4.01/collections-generic-4.01.jar
Downloading: http://dev.davidsoergel.com/nexus/content/groups/public/com/google/collections/google-collections/1.0/google-collections-1.0.jar
Downloading: http://dev.davidsoergel.com/nexus/content/groups/public/org/testng/testng/5.14.10/testng-5.14.10.jar
Downloaded: http://dev.davidsoergel.com/nexus/content/groups/public/commons-logging/commons-logging/1.1.1/commons-logging-1.1.1.jar (60 KB at 338.6 KB/sec)
Downloading: http://dev.davidsoergel.com/nexus/content/groups/public/junit/junit/3.8.1/junit-3.8.1.jar
Downloaded: http://dev.davidsoergel.com/nexus/content/groups/public/commons-lang/commons-lang/2.6/commons-lang-2.6.jar (278 KB at 1374.1 KB/sec)
Downloading: http://dev.davidsoergel.com/nexus/content/groups/public/org/beanshell/bsh/2.0b4/bsh-2.0b4.jar
Downloaded: http://dev.davidsoergel.com/nexus/content/groups/public/net/sourceforge/collections/collections-generic/4.01/collections-generic-4.01.jar (520 KB at 2076.4 KB/sec)
Downloading: http://dev.davidsoergel.com/nexus/content/groups/public/com/beust/jcommander/1.12/jcommander-1.12.jar
Downloaded: http://dev.davidsoergel.com/nexus/content/groups/public/org/testng/testng/5.14.10/testng-5.14.10.jar (559 KB at 1831.5 KB/sec)
Downloading: http://dev.davidsoergel.com/nexus/content/groups/public/org/yaml/snakeyaml/1.6/snakeyaml-1.6.jar
Downloaded: http://dev.davidsoergel.com/nexus/content/groups/public/junit/junit/3.8.1/junit-3.8.1.jar (119 KB at 826.8 KB/sec)
Downloading: http://dev.davidsoergel.com/nexus/content/groups/public/org/slf4j/slf4j-log4j12/1.6.4/slf4j-log4j12-1.6.4.jar
Downloaded: http://dev.davidsoergel.com/nexus/content/groups/public/com/google/collections/google-collections/1.0/google-collections-1.0.jar (625 KB at 1970.4 KB/sec)
Downloading: http://dev.davidsoergel.com/nexus/content/groups/public/org/slf4j/slf4j-api/1.6.4/slf4j-api-1.6.4.jar
Downloaded: http://dev.davidsoergel.com/nexus/content/groups/public/com/beust/jcommander/1.12/jcommander-1.12.jar (31 KB at 118.9 KB/sec)
Downloading: http://dev.davidsoergel.com/nexus/content/groups/public/log4j/log4j/1.2.16/log4j-1.2.16.jar
Downloaded: http://dev.davidsoergel.com/nexus/content/groups/public/org/beanshell/bsh/2.0b4/bsh-2.0b4.jar (276 KB at 851.7 KB/sec)
Downloading: http://dev.davidsoergel.com/nexus/content/groups/public/com/intellij/annotations/7.0.3/annotations-7.0.3.jar
Downloaded: http://dev.davidsoergel.com/nexus/content/groups/public/org/slf4j/slf4j-log4j12/1.6.4/slf4j-log4j12-1.6.4.jar (10 KB at 45.8 KB/sec)
Downloaded: http://dev.davidsoergel.com/nexus/content/groups/public/org/slf4j/slf4j-api/1.6.4/slf4j-api-1.6.4.jar (26 KB at 97.9 KB/sec)
Downloaded: http://dev.davidsoergel.com/nexus/content/groups/public/org/yaml/snakeyaml/1.6/snakeyaml-1.6.jar (227 KB at 842.7 KB/sec)
Downloaded: http://dev.davidsoergel.com/nexus/content/groups/public/com/intellij/annotations/7.0.3/annotations-7.0.3.jar (6 KB at 39.6 KB/sec)
Downloaded: http://dev.davidsoergel.com/nexus/content/groups/public/log4j/log4j/1.2.16/log4j-1.2.16.jar (471 KB at 2197.4 KB/sec)
mojoStarted org.apache.maven.plugins:maven-clean-plugin:2.4.1(default-clean)
[INFO] Downloading: http://dev.davidsoergel.com/nexus/content/groups/public/org/apache/maven/maven-plugin-api/2.0.6/maven-plugin-api-2.0.6.pom
Downloaded: http://dev.davidsoergel.com/nexus/content/groups/public/org/apache/maven/maven-plugin-api/2.0.6/maven-plugin-api-2.0.6.pom (2 KB at 27.9 KB/sec)
Downloading: http://dev.davidsoergel.com/nexus/content/groups/public/org/apache/maven/maven/2.0.6/maven-2.0.6.pom

[INFO] --- maven-clean-plugin:2.4.1:clean (default-clean) @ dsutils ---
Downloaded: http://dev.davidsoergel.com/nexus/content/groups/public/org/apache/maven/maven/2.0.6/maven-2.0.6.pom (9 KB at 37.9 KB/sec)
Downloading: http://dev.davidsoergel.com/nexus/content/groups/public/org/apache/maven/maven-parent/5/maven-parent-5.pom
Downloaded: http://dev.davidsoergel.com/nexus/content/groups/public/org/apache/maven/maven-parent/5/maven-parent-5.pom (15 KB at 45.9 KB/sec)
Downloading: http://dev.davidsoergel.com/nexus/content/groups/public/org/codehaus/plexus/plexus-utils/2.0.5/plexus-utils-2.0.5.pom
Downloaded: http://dev.davidsoergel.com/nexus/content/groups/public/org/codehaus/plexus/plexus-utils/2.0.5/plexus-utils-2.0.5.pom (4 KB at 19.4 KB/sec)
Downloading: http://dev.davidsoergel.com/nexus/content/groups/public/org/codehaus/plexus/plexus/2.0.6/plexus-2.0.6.pom
Downloaded: http://dev.davidsoergel.com/nexus/content/groups/public/org/codehaus/plexus/plexus/2.0.6/plexus-2.0.6.pom (17 KB at 56.1 KB/sec)
Downloading: http://dev.davidsoergel.com/nexus/content/groups/public/org/codehaus/plexus/plexus-utils/2.0.5/plexus-utils-2.0.5.jar
Downloaded: http://dev.davidsoergel.com/nexus/content/groups/public/org/codehaus/plexus/plexus-utils/2.0.5/plexus-utils-2.0.5.jar (218 KB at 1638.6 KB/sec)
mojoSucceeded org.apache.maven.plugins:maven-clean-plugin:2.4.1(default-clean)
mojoStarted org.codehaus.mojo:cobertura-maven-plugin:2.5.1(clean)
[INFO] 
[INFO] --- cobertura-maven-plugin:2.5.1:clean (clean) @ dsutils ---
Downloading: http://dev.davidsoergel.com/nexus/content/groups/public/net/sourceforge/cobertura/cobertura/1.9.4.1/cobertura-1.9.4.1.pom
Downloaded: http://dev.davidsoergel.com/nexus/content/groups/public/net/sourceforge/cobertura/cobertura/1.9.4.1/cobertura-1.9.4.1.pom (2 KB at 19.5 KB/sec)
Downloading: http://dev.davidsoergel.com/nexus/content/groups/public/oro/oro/2.0.8/oro-2.0.8.pom
Downloaded: http://dev.davidsoergel.com/nexus/content/groups/public/oro/oro/2.0.8/oro-2.0.8.pom (140 B at 2.5 KB/sec)
Downloading: http://dev.davidsoergel.com/nexus/content/groups/public/asm/asm/3.0/asm-3.0.pom
Downloaded: http://dev.davidsoergel.com/nexus/content/groups/public/asm/asm/3.0/asm-3.0.pom (360 B at 8.6 KB/sec)
Downloading: http://dev.davidsoergel.com/nexus/content/groups/public/asm/asm-parent/3.0/asm-parent-3.0.pom
Downloaded: http://dev.davidsoergel.com/nexus/content/groups/public/asm/asm-parent/3.0/asm-parent-3.0.pom (3 KB at 29.9 KB/sec)
Downloading: http://dev.davidsoergel.com/nexus/content/groups/public/asm/asm-tree/3.0/asm-tree-3.0.pom
Downloaded: http://dev.davidsoergel.com/nexus/content/groups/public/asm/asm-tree/3.0/asm-tree-3.0.pom (499 B at 5.6 KB/sec)
Downloading: http://dev.davidsoergel.com/nexus/content/groups/public/log4j/log4j/1.2.9/log4j-1.2.9.pom
Downloaded: http://dev.davidsoergel.com/nexus/content/groups/public/log4j/log4j/1.2.9/log4j-1.2.9.pom (144 B at 1.7 KB/sec)
Downloading: http://dev.davidsoergel.com/nexus/content/groups/public/org/apache/ant/ant/1.7.0/ant-1.7.0.pom
Downloaded: http://dev.davidsoergel.com/nexus/content/groups/public/org/apache/ant/ant/1.7.0/ant-1.7.0.pom (10 KB at 179.8 KB/sec)
Downloading: http://dev.davidsoergel.com/nexus/content/groups/public/org/apache/ant/ant-parent/1.7.0/ant-parent-1.7.0.pom
Downloaded: http://dev.davidsoergel.com/nexus/content/groups/public/org/apache/ant/ant-parent/1.7.0/ant-parent-1.7.0.pom (5 KB at 67.9 KB/sec)
Downloading: http://dev.davidsoergel.com/nexus/content/groups/public/org/apache/ant/ant-launcher/1.7.0/ant-launcher-1.7.0.pom
Downloaded: http://dev.davidsoergel.com/nexus/content/groups/public/org/apache/ant/ant-launcher/1.7.0/ant-launcher-1.7.0.pom (3 KB at 21.2 KB/sec)
Downloading: http://dev.davidsoergel.com/nexus/content/groups/public/net/sourceforge/cobertura/cobertura-runtime/1.9.4.1/cobertura-runtime-1.9.4.1.pom
Downloaded: http://dev.davidsoergel.com/nexus/content/groups/public/net/sourceforge/cobertura/cobertura-runtime/1.9.4.1/cobertura-runtime-1.9.4.1.pom (2 KB at 4.2 KB/sec)
Downloading: http://dev.davidsoergel.com/nexus/content/groups/public/urbanophile/java-getopt/1.0.9/java-getopt-1.0.9.pom
Downloaded: http://dev.davidsoergel.com/nexus/content/groups/public/urbanophile/java-getopt/1.0.9/java-getopt-1.0.9.pom (157 B at 1.8 KB/sec)
Downloading: http://dev.davidsoergel.com/nexus/content/groups/public/org/apache/maven/maven-core/2.0.8/maven-core-2.0.8.pom
Downloaded: http://dev.davidsoergel.com/nexus/content/groups/public/org/apache/maven/maven-core/2.0.8/maven-core-2.0.8.pom (7 KB at 101.5 KB/sec)
Downloading: http://dev.davidsoergel.com/nexus/content/groups/public/org/apache/maven/maven/2.0.8/maven-2.0.8.pom
Downloaded: http://dev.davidsoergel.com/nexus/content/groups/public/org/apache/maven/maven/2.0.8/maven-2.0.8.pom (12 KB at 218.7 KB/sec)
Downloading: http://dev.davidsoergel.com/nexus/content/groups/public/org/apache/maven/maven-parent/6/maven-parent-6.pom
Downloaded: http://dev.davidsoergel.com/nexus/content/groups/public/org/apache/maven/maven-parent/6/maven-parent-6.pom (20 KB at 220.0 KB/sec)
Downloading: http://dev.davidsoergel.com/nexus/content/groups/public/org/apache/maven/maven-settings/2.0.8/maven-settings-2.0.8.pom
Downloaded: http://dev.davidsoergel.com/nexus/content/groups/public/org/apache/maven/maven-settings/2.0.8/maven-settings-2.0.8.pom (3 KB at 12.9 KB/sec)
Downloading: http://dev.davidsoergel.com/nexus/content/groups/public/org/apache/maven/maven-model/2.0.8/maven-model-2.0.8.pom
Downloaded: http://dev.davidsoergel.com/nexus/content/groups/public/org/apache/maven/maven-model/2.0.8/maven-model-2.0.8.pom (4 KB at 19.8 KB/sec)
Downloading: http://dev.davidsoergel.com/nexus/content/groups/public/org/codehaus/plexus/plexus-utils/1.4.6/plexus-utils-1.4.6.pom
Downloaded: http://dev.davidsoergel.com/nexus/content/groups/public/org/codehaus/plexus/plexus-utils/1.4.6/plexus-utils-1.4.6.pom (3 KB at 15.7 KB/sec)
Downloading: http://dev.davidsoergel.com/nexus/content/groups/public/org/codehaus/plexus/plexus-container-default/1.0-alpha-9-stable-1/plexus-container-default-1.0-alpha-9-stable-1.pom
Downloaded: http://dev.davidsoergel.com/nexus/content/groups/public/org/codehaus/plexus/plexus-container-default/1.0-alpha-9-stable-1/plexus-container-default-1.0-alpha-9-stable-1.pom (4 KB at 39.0 KB/sec)
Downloading: http://dev.davidsoergel.com/nexus/content/groups/public/org/codehaus/plexus/plexus-containers/1.0.3/plexus-containers-1.0.3.pom
Downloaded: http://dev.davidsoergel.com/nexus/content/groups/public/org/codehaus/plexus/plexus-containers/1.0.3/plexus-containers-1.0.3.pom (492 B at 3.5 KB/sec)
Downloading: http://dev.davidsoergel.com/nexus/content/groups/public/org/codehaus/plexus/plexus/1.0.4/plexus-1.0.4.pom
Downloaded: http://dev.davidsoergel.com/nexus/content/groups/public/org/codehaus/plexus/plexus/1.0.4/plexus-1.0.4.pom (6 KB at 19.9 KB/sec)
Downloading: http://dev.davidsoergel.com/nexus/content/groups/public/junit/junit/3.8.2/junit-3.8.2.pom
Downloaded: http://dev.davidsoergel.com/nexus/content/groups/public/junit/junit/3.8.2/junit-3.8.2.pom (747 B at 12.8 KB/sec)
Downloading: http://dev.davidsoergel.com/nexus/content/groups/public/classworlds/classworlds/1.1-alpha-2/classworlds-1.1-alpha-2.pom
Downloaded: http://dev.davidsoergel.com/nexus/content/groups/public/classworlds/classworlds/1.1-alpha-2/classworlds-1.1-alpha-2.pom (4 KB at 59.9 KB/sec)
Downloading: http://dev.davidsoergel.com/nexus/content/groups/public/org/apache/maven/maven-plugin-parameter-documenter/2.0.8/maven-plugin-parameter-documenter-2.0.8.pom
Downloaded: http://dev.davidsoergel.com/nexus/content/groups/public/org/apache/maven/maven-plugin-parameter-documenter/2.0.8/maven-plugin-parameter-documenter-2.0.8.pom (2 KB at 34.9 KB/sec)
Downloading: http://dev.davidsoergel.com/nexus/content/groups/public/org/apache/maven/reporting/maven-reporting-api/2.0.8/maven-reporting-api-2.0.8.pom
Downloaded: http://dev.davidsoergel.com/nexus/content/groups/public/org/apache/maven/reporting/maven-reporting-api/2.0.8/maven-reporting-api-2.0.8.pom (2 KB at 19.8 KB/sec)
Downloading: http://dev.davidsoergel.com/nexus/content/groups/public/org/apache/maven/reporting/maven-reporting/2.0.8/maven-reporting-2.0.8.pom
Downloaded: http://dev.davidsoergel.com/nexus/content/groups/public/org/apache/maven/reporting/maven-reporting/2.0.8/maven-reporting-2.0.8.pom (2 KB at 14.0 KB/sec)
Downloading: http://dev.davidsoergel.com/nexus/content/groups/public/org/apache/maven/doxia/doxia-sink-api/1.0-alpha-9/doxia-sink-api-1.0-alpha-9.pom
Downloaded: http://dev.davidsoergel.com/nexus/content/groups/public/org/apache/maven/doxia/doxia-sink-api/1.0-alpha-9/doxia-sink-api-1.0-alpha-9.pom (2 KB at 14.0 KB/sec)
Downloading: http://dev.davidsoergel.com/nexus/content/groups/public/org/apache/maven/doxia/doxia/1.0-alpha-9/doxia-1.0-alpha-9.pom
Downloaded: http://dev.davidsoergel.com/nexus/content/groups/public/org/apache/maven/doxia/doxia/1.0-alpha-9/doxia-1.0-alpha-9.pom (9 KB at 165.6 KB/sec)
Downloading: http://dev.davidsoergel.com/nexus/content/groups/public/org/apache/maven/maven-profile/2.0.8/maven-profile-2.0.8.pom
Downloaded: http://dev.davidsoergel.com/nexus/content/groups/public/org/apache/maven/maven-profile/2.0.8/maven-profile-2.0.8.pom (2 KB at 39.0 KB/sec)
Downloading: http://dev.davidsoergel.com/nexus/content/groups/public/org/apache/maven/maven-artifact/2.0.8/maven-artifact-2.0.8.pom
Downloaded: http://dev.davidsoergel.com/nexus/content/groups/public/org/apache/maven/maven-artifact/2.0.8/maven-artifact-2.0.8.pom (2 KB at 19.3 KB/sec)
Downloading: http://dev.davidsoergel.com/nexus/content/groups/public/org/apache/maven/maven-repository-metadata/2.0.8/maven-repository-metadata-2.0.8.pom
Downloaded: http://dev.davidsoergel.com/nexus/content/groups/public/org/apache/maven/maven-repository-metadata/2.0.8/maven-repository-metadata-2.0.8.pom (2 KB at 20.2 KB/sec)
Downloading: http://dev.davidsoergel.com/nexus/content/groups/public/org/apache/maven/maven-error-diagnostics/2.0.8/maven-error-diagnostics-2.0.8.pom
Downloaded: http://dev.davidsoergel.com/nexus/content/groups/public/org/apache/maven/maven-error-diagnostics/2.0.8/maven-error-diagnostics-2.0.8.pom (2 KB at 20.0 KB/sec)
Downloading: http://dev.davidsoergel.com/nexus/content/groups/public/org/apache/maven/maven-project/2.0.8/maven-project-2.0.8.pom
Downloaded: http://dev.davidsoergel.com/nexus/content/groups/public/org/apache/maven/maven-project/2.0.8/maven-project-2.0.8.pom (3 KB at 5.1 KB/sec)
Downloading: http://dev.davidsoergel.com/nexus/content/groups/public/org/apache/maven/maven-artifact-manager/2.0.8/maven-artifact-manager-2.0.8.pom
Downloaded: http://dev.davidsoergel.com/nexus/content/groups/public/org/apache/maven/maven-artifact-manager/2.0.8/maven-artifact-manager-2.0.8.pom (3 KB at 36.6 KB/sec)
Downloading: http://dev.davidsoergel.com/nexus/content/groups/public/org/apache/maven/maven-plugin-registry/2.0.8/maven-plugin-registry-2.0.8.pom
Downloaded: http://dev.davidsoergel.com/nexus/content/groups/public/org/apache/maven/maven-plugin-registry/2.0.8/maven-plugin-registry-2.0.8.pom (2 KB at 17.1 KB/sec)
Downloading: http://dev.davidsoergel.com/nexus/content/groups/public/commons-cli/commons-cli/1.0/commons-cli-1.0.pom
Downloaded: http://dev.davidsoergel.com/nexus/content/groups/public/commons-cli/commons-cli/1.0/commons-cli-1.0.pom (3 KB at 36.7 KB/sec)
Downloading: http://dev.davidsoergel.com/nexus/content/groups/public/org/apache/maven/maven-plugin-api/2.0/maven-plugin-api-2.0.pom
Downloaded: http://dev.davidsoergel.com/nexus/content/groups/public/org/apache/maven/maven-plugin-api/2.0/maven-plugin-api-2.0.pom (601 B at 4.8 KB/sec)
Downloading: http://dev.davidsoergel.com/nexus/content/groups/public/org/apache/maven/maven/2.0/maven-2.0.pom
Downloaded: http://dev.davidsoergel.com/nexus/content/groups/public/org/apache/maven/maven/2.0/maven-2.0.pom (9 KB at 53.2 KB/sec)
Downloading: http://dev.davidsoergel.com/nexus/content/groups/public/org/apache/maven/maven-plugin-descriptor/2.0.8/maven-plugin-descriptor-2.0.8.pom
Downloaded: http://dev.davidsoergel.com/nexus/content/groups/public/org/apache/maven/maven-plugin-descriptor/2.0.8/maven-plugin-descriptor-2.0.8.pom (3 KB at 77.9 KB/sec)
Downloading: http://dev.davidsoergel.com/nexus/content/groups/public/org/codehaus/plexus/plexus-interactivity-api/1.0-alpha-4/plexus-interactivity-api-1.0-alpha-4.pom
Downloaded: http://dev.davidsoergel.com/nexus/content/groups/public/org/codehaus/plexus/plexus-interactivity-api/1.0-alpha-4/plexus-interactivity-api-1.0-alpha-4.pom (7 KB at 256.5 KB/sec)
Downloading: http://dev.davidsoergel.com/nexus/content/groups/public/org/apache/maven/maven-monitor/2.0.8/maven-monitor-2.0.8.pom
Downloaded: http://dev.davidsoergel.com/nexus/content/groups/public/org/apache/maven/maven-monitor/2.0.8/maven-monitor-2.0.8.pom (2 KB at 35.9 KB/sec)
Downloading: http://dev.davidsoergel.com/nexus/content/groups/public/classworlds/classworlds/1.1/classworlds-1.1.pom
Downloaded: http://dev.davidsoergel.com/nexus/content/groups/public/classworlds/classworlds/1.1/classworlds-1.1.pom (4 KB at 49.9 KB/sec)
Downloading: http://dev.davidsoergel.com/nexus/content/groups/public/org/apache/maven/maven-plugin-api/2.0.8/maven-plugin-api-2.0.8.pom
Downloaded: http://dev.davidsoergel.com/nexus/content/groups/public/org/apache/maven/maven-plugin-api/2.0.8/maven-plugin-api-2.0.8.pom (2 KB at 16.2 KB/sec)
Downloading: http://dev.davidsoergel.com/nexus/content/groups/public/org/apache/maven/reporting/maven-reporting-impl/2.0.4.2/maven-reporting-impl-2.0.4.2.pom
Downloaded: http://dev.davidsoergel.com/nexus/content/groups/public/org/apache/maven/reporting/maven-reporting-impl/2.0.4.2/maven-reporting-impl-2.0.4.2.pom (6 KB at 22.0 KB/sec)
Downloading: http://dev.davidsoergel.com/nexus/content/groups/public/org/apache/maven/shared/maven-shared-components/11/maven-shared-components-11.pom
Downloaded: http://dev.davidsoergel.com/nexus/content/groups/public/org/apache/maven/shared/maven-shared-components/11/maven-shared-components-11.pom (9 KB at 145.5 KB/sec)
Downloading: http://dev.davidsoergel.com/nexus/content/groups/public/org/apache/maven/maven-parent/11/maven-parent-11.pom
Downloaded: http://dev.davidsoergel.com/nexus/content/groups/public/org/apache/maven/maven-parent/11/maven-parent-11.pom (32 KB at 347.8 KB/sec)
Downloading: http://dev.davidsoergel.com/nexus/content/groups/public/org/apache/apache/5/apache-5.pom
Downloaded: http://dev.davidsoergel.com/nexus/content/groups/public/org/apache/apache/5/apache-5.pom (5 KB at 76.9 KB/sec)
Downloading: http://dev.davidsoergel.com/nexus/content/groups/public/org/apache/maven/maven-project/2.0.4/maven-project-2.0.4.pom
Downloaded: http://dev.davidsoergel.com/nexus/content/groups/public/org/apache/maven/maven-project/2.0.4/maven-project-2.0.4.pom (2 KB at 30.5 KB/sec)
Downloading: http://dev.davidsoergel.com/nexus/content/groups/public/org/apache/maven/maven/2.0.4/maven-2.0.4.pom
Downloaded: http://dev.davidsoergel.com/nexus/content/groups/public/org/apache/maven/maven/2.0.4/maven-2.0.4.pom (12 KB at 221.5 KB/sec)
Downloading: http://dev.davidsoergel.com/nexus/content/groups/public/org/apache/maven/maven-settings/2.0.4/maven-settings-2.0.4.pom
Downloaded: http://dev.davidsoergel.com/nexus/content/groups/public/org/apache/maven/maven-settings/2.0.4/maven-settings-2.0.4.pom (2 KB at 6.8 KB/sec)
Downloading: http://dev.davidsoergel.com/nexus/content/groups/public/org/apache/maven/maven-model/2.0.4/maven-model-2.0.4.pom
Downloaded: http://dev.davidsoergel.com/nexus/content/groups/public/org/apache/maven/maven-model/2.0.4/maven-model-2.0.4.pom (3 KB at 13.7 KB/sec)
Downloading: http://dev.davidsoergel.com/nexus/content/groups/public/org/codehaus/plexus/plexus-utils/1.1/plexus-utils-1.1.pom
Downloaded: http://dev.davidsoergel.com/nexus/content/groups/public/org/codehaus/plexus/plexus-utils/1.1/plexus-utils-1.1.pom (767 B at 10.3 KB/sec)
Downloading: http://dev.davidsoergel.com/nexus/content/groups/public/org/codehaus/plexus/plexus-container-default/1.0-alpha-9/plexus-container-default-1.0-alpha-9.pom
Downloaded: http://dev.davidsoergel.com/nexus/content/groups/public/org/codehaus/plexus/plexus-container-default/1.0-alpha-9/plexus-container-default-1.0-alpha-9.pom (2 KB at 17.5 KB/sec)
Downloading: http://dev.davidsoergel.com/nexus/content/groups/public/org/apache/maven/maven-profile/2.0.4/maven-profile-2.0.4.pom
Downloaded: http://dev.davidsoergel.com/nexus/content/groups/public/org/apache/maven/maven-profile/2.0.4/maven-profile-2.0.4.pom (2 KB at 29.3 KB/sec)
Downloading: http://dev.davidsoergel.com/nexus/content/groups/public/org/apache/maven/maven-artifact-manager/2.0.4/maven-artifact-manager-2.0.4.pom
Downloaded: http://dev.davidsoergel.com/nexus/content/groups/public/org/apache/maven/maven-artifact-manager/2.0.4/maven-artifact-manager-2.0.4.pom (2 KB at 27.6 KB/sec)
Downloading: http://dev.davidsoergel.com/nexus/content/groups/public/org/apache/maven/maven-repository-metadata/2.0.4/maven-repository-metadata-2.0.4.pom
Downloaded: http://dev.davidsoergel.com/nexus/content/groups/public/org/apache/maven/maven-repository-metadata/2.0.4/maven-repository-metadata-2.0.4.pom (2 KB at 18.6 KB/sec)
Downloading: http://dev.davidsoergel.com/nexus/content/groups/public/org/apache/maven/maven-artifact/2.0.4/maven-artifact-2.0.4.pom
Downloaded: http://dev.davidsoergel.com/nexus/content/groups/public/org/apache/maven/maven-artifact/2.0.4/maven-artifact-2.0.4.pom (765 B at 13.8 KB/sec)
Downloading: http://dev.davidsoergel.com/nexus/content/groups/public/commons-validator/commons-validator/1.2.0/commons-validator-1.2.0.pom
Downloaded: http://dev.davidsoergel.com/nexus/content/groups/public/commons-validator/commons-validator/1.2.0/commons-validator-1.2.0.pom (9 KB at 167.4 KB/sec)
Downloading: http://dev.davidsoergel.com/nexus/content/groups/public/commons-beanutils/commons-beanutils/1.7.0/commons-beanutils-1.7.0.pom
Downloaded: http://dev.davidsoergel.com/nexus/content/groups/public/commons-beanutils/commons-beanutils/1.7.0/commons-beanutils-1.7.0.pom (357 B at 3.6 KB/sec)
Downloading: http://dev.davidsoergel.com/nexus/content/groups/public/commons-digester/commons-digester/1.6/commons-digester-1.6.pom
Downloaded: http://dev.davidsoergel.com/nexus/content/groups/public/commons-digester/commons-digester/1.6/commons-digester-1.6.pom (974 B at 4.9 KB/sec)
Downloading: http://dev.davidsoergel.com/nexus/content/groups/public/commons-beanutils/commons-beanutils/1.6/commons-beanutils-1.6.pom
Downloaded: http://dev.davidsoergel.com/nexus/content/groups/public/commons-beanutils/commons-beanutils/1.6/commons-beanutils-1.6.pom (3 KB at 16.5 KB/sec)
Downloading: http://dev.davidsoergel.com/nexus/content/groups/public/commons-logging/commons-logging/1.0/commons-logging-1.0.pom
Downloaded: http://dev.davidsoergel.com/nexus/content/groups/public/commons-logging/commons-logging/1.0/commons-logging-1.0.pom (163 B at 1.4 KB/sec)
Downloading: http://dev.davidsoergel.com/nexus/content/groups/public/commons-collections/commons-collections/2.0/commons-collections-2.0.pom
Downloaded: http://dev.davidsoergel.com/nexus/content/groups/public/commons-collections/commons-collections/2.0/commons-collections-2.0.pom (171 B at 6.4 KB/sec)
Downloading: http://dev.davidsoergel.com/nexus/content/groups/public/commons-collections/commons-collections/2.1/commons-collections-2.1.pom
Downloaded: http://dev.davidsoergel.com/nexus/content/groups/public/commons-collections/commons-collections/2.1/commons-collections-2.1.pom (4 KB at 22.0 KB/sec)
Downloading: http://dev.davidsoergel.com/nexus/content/groups/public/xml-apis/xml-apis/1.0.b2/xml-apis-1.0.b2.pom
Downloaded: http://dev.davidsoergel.com/nexus/content/groups/public/xml-apis/xml-apis/1.0.b2/xml-apis-1.0.b2.pom (3 KB at 11.4 KB/sec)
Downloading: http://dev.davidsoergel.com/nexus/content/groups/public/xml-apis/xml-apis/2.0.2/xml-apis-2.0.2.pom
Downloaded: http://dev.davidsoergel.com/nexus/content/groups/public/xml-apis/xml-apis/2.0.2/xml-apis-2.0.2.pom (346 B at 2.3 KB/sec)
Downloading: http://dev.davidsoergel.com/nexus/content/groups/public/org/apache/maven/doxia/doxia-core/1.0/doxia-core-1.0.pom
Downloaded: http://dev.davidsoergel.com/nexus/content/groups/public/org/apache/maven/doxia/doxia-core/1.0/doxia-core-1.0.pom (3 KB at 16.2 KB/sec)
Downloading: http://dev.davidsoergel.com/nexus/content/groups/public/org/apache/maven/doxia/doxia/1.0/doxia-1.0.pom
Downloaded: http://dev.davidsoergel.com/nexus/content/groups/public/org/apache/maven/doxia/doxia/1.0/doxia-1.0.pom (10 KB at 84.1 KB/sec)
Downloading: http://dev.davidsoergel.com/nexus/content/groups/public/org/apache/maven/maven-parent/10/maven-parent-10.pom
Downloaded: http://dev.davidsoergel.com/nexus/content/groups/public/org/apache/maven/maven-parent/10/maven-parent-10.pom (31 KB at 347.1 KB/sec)
Downloading: http://dev.davidsoergel.com/nexus/content/groups/public/org/apache/maven/doxia/doxia-sink-api/1.0/doxia-sink-api-1.0.pom
Downloaded: http://dev.davidsoergel.com/nexus/content/groups/public/org/apache/maven/doxia/doxia-sink-api/1.0/doxia-sink-api-1.0.pom (2 KB at 26.6 KB/sec)
Downloading: http://dev.davidsoergel.com/nexus/content/groups/public/org/codehaus/plexus/plexus-utils/1.5.7/plexus-utils-1.5.7.pom
Downloaded: http://dev.davidsoergel.com/nexus/content/groups/public/org/codehaus/plexus/plexus-utils/1.5.7/plexus-utils-1.5.7.pom (8 KB at 164.0 KB/sec)
Downloading: http://dev.davidsoergel.com/nexus/content/groups/public/org/codehaus/plexus/plexus/2.0.2/plexus-2.0.2.pom
Downloaded: http://dev.davidsoergel.com/nexus/content/groups/public/org/codehaus/plexus/plexus/2.0.2/plexus-2.0.2.pom (12 KB at 206.1 KB/sec)
Downloading: http://dev.davidsoergel.com/nexus/content/groups/public/org/codehaus/plexus/plexus-container-default/1.0-alpha-30/plexus-container-default-1.0-alpha-30.pom
Downloaded: http://dev.davidsoergel.com/nexus/content/groups/public/org/codehaus/plexus/plexus-container-default/1.0-alpha-30/plexus-container-default-1.0-alpha-30.pom (4 KB at 38.2 KB/sec)
Downloading: http://dev.davidsoergel.com/nexus/content/groups/public/org/codehaus/plexus/plexus-containers/1.0-alpha-30/plexus-containers-1.0-alpha-30.pom
Downloaded: http://dev.davidsoergel.com/nexus/content/groups/public/org/codehaus/plexus/plexus-containers/1.0-alpha-30/plexus-containers-1.0-alpha-30.pom (2 KB at 20.8 KB/sec)
Downloading: http://dev.davidsoergel.com/nexus/content/groups/public/org/codehaus/plexus/plexus-utils/1.4.5/plexus-utils-1.4.5.pom
Downloaded: http://dev.davidsoergel.com/nexus/content/groups/public/org/codehaus/plexus/plexus-utils/1.4.5/plexus-utils-1.4.5.pom (3 KB at 24.9 KB/sec)
Downloading: http://dev.davidsoergel.com/nexus/content/groups/public/org/codehaus/plexus/plexus-classworlds/1.2-alpha-9/plexus-classworlds-1.2-alpha-9.pom
Downloaded: http://dev.davidsoergel.com/nexus/content/groups/public/org/codehaus/plexus/plexus-classworlds/1.2-alpha-9/plexus-classworlds-1.2-alpha-9.pom (4 KB at 58.3 KB/sec)
Downloading: http://dev.davidsoergel.com/nexus/content/groups/public/org/apache/maven/reporting/maven-reporting-api/2.0.4/maven-reporting-api-2.0.4.pom
Downloaded: http://dev.davidsoergel.com/nexus/content/groups/public/org/apache/maven/reporting/maven-reporting-api/2.0.4/maven-reporting-api-2.0.4.pom (902 B at 14.7 KB/sec)
Downloading: http://dev.davidsoergel.com/nexus/content/groups/public/org/apache/maven/reporting/maven-reporting/2.0.4/maven-reporting-2.0.4.pom
Downloaded: http://dev.davidsoergel.com/nexus/content/groups/public/org/apache/maven/reporting/maven-reporting/2.0.4/maven-reporting-2.0.4.pom (700 B at 7.9 KB/sec)
Downloading: http://dev.davidsoergel.com/nexus/content/groups/public/org/apache/maven/doxia/doxia-sink-api/1.0-alpha-7/doxia-sink-api-1.0-alpha-7.pom
Downloaded: http://dev.davidsoergel.com/nexus/content/groups/public/org/apache/maven/doxia/doxia-sink-api/1.0-alpha-7/doxia-sink-api-1.0-alpha-7.pom (424 B at 6.1 KB/sec)
Downloading: http://dev.davidsoergel.com/nexus/content/groups/public/org/apache/maven/doxia/doxia/1.0-alpha-7/doxia-1.0-alpha-7.pom
Downloaded: http://dev.davidsoergel.com/nexus/content/groups/public/org/apache/maven/doxia/doxia/1.0-alpha-7/doxia-1.0-alpha-7.pom (4 KB at 49.0 KB/sec)
Downloading: http://dev.davidsoergel.com/nexus/content/groups/public/org/apache/maven/doxia/doxia-site-renderer/1.0/doxia-site-renderer-1.0.pom
Downloaded: http://dev.davidsoergel.com/nexus/content/groups/public/org/apache/maven/doxia/doxia-site-renderer/1.0/doxia-site-renderer-1.0.pom (5 KB at 92.0 KB/sec)
Downloading: http://dev.davidsoergel.com/nexus/content/groups/public/org/apache/maven/doxia/doxia-sitetools/1.0/doxia-sitetools-1.0.pom
Downloaded: http://dev.davidsoergel.com/nexus/content/groups/public/org/apache/maven/doxia/doxia-sitetools/1.0/doxia-sitetools-1.0.pom (10 KB at 92.7 KB/sec)
Downloading: http://dev.davidsoergel.com/nexus/content/groups/public/org/codehaus/plexus/plexus-i18n/1.0-beta-7/plexus-i18n-1.0-beta-7.pom
Downloaded: http://dev.davidsoergel.com/nexus/content/groups/public/org/codehaus/plexus/plexus-i18n/1.0-beta-7/plexus-i18n-1.0-beta-7.pom (2 KB at 12.2 KB/sec)
Downloading: http://dev.davidsoergel.com/nexus/content/groups/public/org/codehaus/plexus/plexus-components/1.1.12/plexus-components-1.1.12.pom
Downloaded: http://dev.davidsoergel.com/nexus/content/groups/public/org/codehaus/plexus/plexus-components/1.1.12/plexus-components-1.1.12.pom (3 KB at 45.8 KB/sec)
Downloading: http://dev.davidsoergel.com/nexus/content/groups/public/org/codehaus/plexus/plexus-utils/1.4.1/plexus-utils-1.4.1.pom
Downloaded: http://dev.davidsoergel.com/nexus/content/groups/public/org/codehaus/plexus/plexus-utils/1.4.1/plexus-utils-1.4.1.pom (2 KB at 36.6 KB/sec)
Downloading: http://dev.davidsoergel.com/nexus/content/groups/public/org/codehaus/plexus/plexus-velocity/1.1.7/plexus-velocity-1.1.7.pom
Downloaded: http://dev.davidsoergel.com/nexus/content/groups/public/org/codehaus/plexus/plexus-velocity/1.1.7/plexus-velocity-1.1.7.pom (2 KB at 22.0 KB/sec)
Downloading: http://dev.davidsoergel.com/nexus/content/groups/public/org/codehaus/plexus/plexus-container-default/1.0-alpha-20/plexus-container-default-1.0-alpha-20.pom
Downloaded: http://dev.davidsoergel.com/nexus/content/groups/public/org/codehaus/plexus/plexus-container-default/1.0-alpha-20/plexus-container-default-1.0-alpha-20.pom (3 KB at 108.2 KB/sec)
Downloading: http://dev.davidsoergel.com/nexus/content/groups/public/org/codehaus/plexus/plexus-containers/1.0-alpha-20/plexus-containers-1.0-alpha-20.pom
Downloaded: http://dev.davidsoergel.com/nexus/content/groups/public/org/codehaus/plexus/plexus-containers/1.0-alpha-20/plexus-containers-1.0-alpha-20.pom (2 KB at 22.2 KB/sec)
Downloading: http://dev.davidsoergel.com/nexus/content/groups/public/org/codehaus/plexus/plexus-utils/1.3/plexus-utils-1.3.pom
Downloaded: http://dev.davidsoergel.com/nexus/content/groups/public/org/codehaus/plexus/plexus-utils/1.3/plexus-utils-1.3.pom (2 KB at 0.5 KB/sec)
Downloading: http://dev.davidsoergel.com/nexus/content/groups/public/org/codehaus/plexus/plexus/1.0.8/plexus-1.0.8.pom
Downloaded: http://dev.davidsoergel.com/nexus/content/groups/public/org/codehaus/plexus/plexus/1.0.8/plexus-1.0.8.pom (8 KB at 126.1 KB/sec)
Downloading: http://dev.davidsoergel.com/nexus/content/groups/public/org/codehaus/plexus/plexus-classworlds/1.2-alpha-7/plexus-classworlds-1.2-alpha-7.pom
Downloaded: http://dev.davidsoergel.com/nexus/content/groups/public/org/codehaus/plexus/plexus-classworlds/1.2-alpha-7/plexus-classworlds-1.2-alpha-7.pom (3 KB at 42.1 KB/sec)
Downloading: http://dev.davidsoergel.com/nexus/content/groups/public/org/codehaus/plexus/plexus/1.0.9/plexus-1.0.9.pom
Downloaded: http://dev.davidsoergel.com/nexus/content/groups/public/org/codehaus/plexus/plexus/1.0.9/plexus-1.0.9.pom (8 KB at 87.2 KB/sec)
Downloading: http://dev.davidsoergel.com/nexus/content/groups/public/org/apache/velocity/velocity/1.5/velocity-1.5.pom
Downloaded: http://dev.davidsoergel.com/nexus/content/groups/public/org/apache/velocity/velocity/1.5/velocity-1.5.pom (8 KB at 135.4 KB/sec)
Downloading: http://dev.davidsoergel.com/nexus/content/groups/public/commons-collections/commons-collections/3.1/commons-collections-3.1.pom
Downloaded: http://dev.davidsoergel.com/nexus/content/groups/public/commons-collections/commons-collections/3.1/commons-collections-3.1.pom (6 KB at 106.1 KB/sec)
Downloading: http://dev.davidsoergel.com/nexus/content/groups/public/commons-lang/commons-lang/2.1/commons-lang-2.1.pom
Downloaded: http://dev.davidsoergel.com/nexus/content/groups/public/commons-lang/commons-lang/2.1/commons-lang-2.1.pom (10 KB at 116.8 KB/sec)
Downloading: http://dev.davidsoergel.com/nexus/content/groups/public/org/apache/maven/doxia/doxia-decoration-model/1.0/doxia-decoration-model-1.0.pom
Downloaded: http://dev.davidsoergel.com/nexus/content/groups/public/org/apache/maven/doxia/doxia-decoration-model/1.0/doxia-decoration-model-1.0.pom (4 KB at 46.0 KB/sec)
Downloading: http://dev.davidsoergel.com/nexus/content/groups/public/commons-collections/commons-collections/3.2/commons-collections-3.2.pom
Downloaded: http://dev.davidsoergel.com/nexus/content/groups/public/commons-collections/commons-collections/3.2/commons-collections-3.2.pom (11 KB at 90.5 KB/sec)
Downloading: http://dev.davidsoergel.com/nexus/content/groups/public/org/apache/maven/doxia/doxia-module-apt/1.0/doxia-module-apt-1.0.pom
Downloaded: http://dev.davidsoergel.com/nexus/content/groups/public/org/apache/maven/doxia/doxia-module-apt/1.0/doxia-module-apt-1.0.pom (3 KB at 40.7 KB/sec)
Downloading: http://dev.davidsoergel.com/nexus/content/groups/public/org/apache/maven/doxia/doxia-modules/1.0/doxia-modules-1.0.pom
Downloaded: http://dev.davidsoergel.com/nexus/content/groups/public/org/apache/maven/doxia/doxia-modules/1.0/doxia-modules-1.0.pom (3 KB at 28.9 KB/sec)
Downloading: http://dev.davidsoergel.com/nexus/content/groups/public/org/apache/maven/doxia/doxia-module-fml/1.0/doxia-module-fml-1.0.pom
Downloaded: http://dev.davidsoergel.com/nexus/content/groups/public/org/apache/maven/doxia/doxia-module-fml/1.0/doxia-module-fml-1.0.pom (3 KB at 27.7 KB/sec)
Downloading: http://dev.davidsoergel.com/nexus/content/groups/public/org/apache/maven/doxia/doxia-module-xdoc/1.0/doxia-module-xdoc-1.0.pom
Downloaded: http://dev.davidsoergel.com/nexus/content/groups/public/org/apache/maven/doxia/doxia-module-xdoc/1.0/doxia-module-xdoc-1.0.pom (3 KB at 31.7 KB/sec)
Downloading: http://dev.davidsoergel.com/nexus/content/groups/public/org/apache/maven/doxia/doxia-module-xhtml/1.0/doxia-module-xhtml-1.0.pom
Downloaded: http://dev.davidsoergel.com/nexus/content/groups/public/org/apache/maven/doxia/doxia-module-xhtml/1.0/doxia-module-xhtml-1.0.pom (2 KB at 15.3 KB/sec)
Downloading: http://dev.davidsoergel.com/nexus/content/groups/public/commons-lang/commons-lang/2.4/commons-lang-2.4.pom
Downloaded: http://dev.davidsoergel.com/nexus/content/groups/public/commons-lang/commons-lang/2.4/commons-lang-2.4.pom (14 KB at 310.2 KB/sec)
Downloading: http://dev.davidsoergel.com/nexus/content/groups/public/org/apache/commons/commons-parent/9/commons-parent-9.pom
Downloaded: http://dev.davidsoergel.com/nexus/content/groups/public/org/apache/commons/commons-parent/9/commons-parent-9.pom (22 KB at 163.5 KB/sec)
Downloading: http://dev.davidsoergel.com/nexus/content/groups/public/org/codehaus/plexus/plexus-utils/2.0.2/plexus-utils-2.0.2.pom
Downloaded: http://dev.davidsoergel.com/nexus/content/groups/public/org/codehaus/plexus/plexus-utils/2.0.2/plexus-utils-2.0.2.pom (4 KB at 20.2 KB/sec)
Downloading: http://dev.davidsoergel.com/nexus/content/groups/public/org/apache/maven/shared/maven-invoker/2.0.11/maven-invoker-2.0.11.pom
Downloaded: http://dev.davidsoergel.com/nexus/content/groups/public/org/apache/maven/shared/maven-invoker/2.0.11/maven-invoker-2.0.11.pom (5 KB at 52.7 KB/sec)
Downloading: http://dev.davidsoergel.com/nexus/content/groups/public/org/apache/maven/shared/maven-shared-components/12/maven-shared-components-12.pom
Downloaded: http://dev.davidsoergel.com/nexus/content/groups/public/org/apache/maven/shared/maven-shared-components/12/maven-shared-components-12.pom (10 KB at 165.8 KB/sec)
Downloading: http://dev.davidsoergel.com/nexus/content/groups/public/org/apache/maven/maven-parent/13/maven-parent-13.pom
Downloaded: http://dev.davidsoergel.com/nexus/content/groups/public/org/apache/maven/maven-parent/13/maven-parent-13.pom (23 KB at 172.7 KB/sec)
Downloading: http://dev.davidsoergel.com/nexus/content/groups/public/org/codehaus/plexus/plexus-utils/1.5.6/plexus-utils-1.5.6.pom
Downloaded: http://dev.davidsoergel.com/nexus/content/groups/public/org/codehaus/plexus/plexus-utils/1.5.6/plexus-utils-1.5.6.pom (6 KB at 97.7 KB/sec)
Downloading: http://dev.davidsoergel.com/nexus/content/groups/public/org/codehaus/plexus/plexus/1.0.12/plexus-1.0.12.pom
Downloaded: http://dev.davidsoergel.com/nexus/content/groups/public/org/codehaus/plexus/plexus/1.0.12/plexus-1.0.12.pom (10 KB at 177.2 KB/sec)
Downloading: http://dev.davidsoergel.com/nexus/content/groups/public/net/sourceforge/cobertura/cobertura/1.9.4.1/cobertura-1.9.4.1.jar
Downloading: http://dev.davidsoergel.com/nexus/content/groups/public/oro/oro/2.0.8/oro-2.0.8.jar
Downloading: http://dev.davidsoergel.com/nexus/content/groups/public/asm/asm/3.0/asm-3.0.jar
Downloading: http://dev.davidsoergel.com/nexus/content/groups/public/asm/asm-tree/3.0/asm-tree-3.0.jar
Downloading: http://dev.davidsoergel.com/nexus/content/groups/public/log4j/log4j/1.2.9/log4j-1.2.9.jar
Downloaded: http://dev.davidsoergel.com/nexus/content/groups/public/asm/asm/3.0/asm-3.0.jar (42 KB at 264.0 KB/sec)
Downloading: http://dev.davidsoergel.com/nexus/content/groups/public/org/apache/ant/ant/1.7.0/ant-1.7.0.jar
Downloaded: http://dev.davidsoergel.com/nexus/content/groups/public/oro/oro/2.0.8/oro-2.0.8.jar (64 KB at 313.9 KB/sec)
Downloading: http://dev.davidsoergel.com/nexus/content/groups/public/org/apache/ant/ant-launcher/1.7.0/ant-launcher-1.7.0.jar
Downloaded: http://dev.davidsoergel.com/nexus/content/groups/public/asm/asm-tree/3.0/asm-tree-3.0.jar (22 KB at 80.8 KB/sec)
Downloading: http://dev.davidsoergel.com/nexus/content/groups/public/urbanophile/java-getopt/1.0.9/java-getopt-1.0.9.jar
Downloaded: http://dev.davidsoergel.com/nexus/content/groups/public/net/sourceforge/cobertura/cobertura/1.9.4.1/cobertura-1.9.4.1.jar (443 KB at 1615.8 KB/sec)
Downloading: http://dev.davidsoergel.com/nexus/content/groups/public/commons-cli/commons-cli/1.0/commons-cli-1.0.jar
Downloaded: http://dev.davidsoergel.com/nexus/content/groups/public/log4j/log4j/1.2.9/log4j-1.2.9.jar (345 KB at 1303.2 KB/sec)
Downloading: http://dev.davidsoergel.com/nexus/content/groups/public/org/codehaus/plexus/plexus-interactivity-api/1.0-alpha-4/plexus-interactivity-api-1.0-alpha-4.jar
Downloaded: http://dev.davidsoergel.com/nexus/content/groups/public/org/apache/ant/ant-launcher/1.7.0/ant-launcher-1.7.0.jar (12 KB at 88.8 KB/sec)
Downloading: http://dev.davidsoergel.com/nexus/content/groups/public/org/apache/maven/reporting/maven-reporting-api/2.0.8/maven-reporting-api-2.0.8.jar
Downloaded: http://dev.davidsoergel.com/nexus/content/groups/public/urbanophile/java-getopt/1.0.9/java-getopt-1.0.9.jar (53 KB at 683.3 KB/sec)
Downloading: http://dev.davidsoergel.com/nexus/content/groups/public/org/apache/maven/doxia/doxia-sink-api/1.0-alpha-9/doxia-sink-api-1.0-alpha-9.jar
Downloaded: http://dev.davidsoergel.com/nexus/content/groups/public/commons-cli/commons-cli/1.0/commons-cli-1.0.jar (30 KB at 200.1 KB/sec)
Downloading: http://dev.davidsoergel.com/nexus/content/groups/public/org/apache/maven/reporting/maven-reporting-impl/2.0.4.2/maven-reporting-impl-2.0.4.2.jar
Downloaded: http://dev.davidsoergel.com/nexus/content/groups/public/org/codehaus/plexus/plexus-interactivity-api/1.0-alpha-4/plexus-interactivity-api-1.0-alpha-4.jar (14 KB at 38.1 KB/sec)
Downloaded: http://dev.davidsoergel.com/nexus/content/groups/public/org/apache/maven/reporting/maven-reporting-api/2.0.8/maven-reporting-api-2.0.8.jar (10 KB at 34.6 KB/sec)
Downloading: http://dev.davidsoergel.com/nexus/content/groups/public/commons-validator/commons-validator/1.2.0/commons-validator-1.2.0.jar
Downloading: http://dev.davidsoergel.com/nexus/content/groups/public/commons-beanutils/commons-beanutils/1.7.0/commons-beanutils-1.7.0.jar
Downloaded: http://dev.davidsoergel.com/nexus/content/groups/public/org/apache/maven/doxia/doxia-sink-api/1.0-alpha-9/doxia-sink-api-1.0-alpha-9.jar (10 KB at 34.6 KB/sec)
Downloading: http://dev.davidsoergel.com/nexus/content/groups/public/commons-digester/commons-digester/1.6/commons-digester-1.6.jar
Downloaded: http://dev.davidsoergel.com/nexus/content/groups/public/org/apache/maven/reporting/maven-reporting-impl/2.0.4.2/maven-reporting-impl-2.0.4.2.jar (20 KB at 74.7 KB/sec)
Downloading: http://dev.davidsoergel.com/nexus/content/groups/public/xml-apis/xml-apis/1.0.b2/xml-apis-1.0.b2.jar
Downloaded: http://dev.davidsoergel.com/nexus/content/groups/public/org/apache/ant/ant/1.7.0/ant-1.7.0.jar (1260 KB at 2390.1 KB/sec)
Downloading: http://dev.davidsoergel.com/nexus/content/groups/public/org/apache/maven/doxia/doxia-core/1.0/doxia-core-1.0.jar
Downloaded: http://dev.davidsoergel.com/nexus/content/groups/public/commons-beanutils/commons-beanutils/1.7.0/commons-beanutils-1.7.0.jar (185 KB at 1395.8 KB/sec)
Downloading: http://dev.davidsoergel.com/nexus/content/groups/public/org/apache/maven/doxia/doxia-site-renderer/1.0/doxia-site-renderer-1.0.jar
Downloaded: http://dev.davidsoergel.com/nexus/content/groups/public/commons-digester/commons-digester/1.6/commons-digester-1.6.jar (165 KB at 1200.7 KB/sec)
Downloading: http://dev.davidsoergel.com/nexus/content/groups/public/org/codehaus/plexus/plexus-i18n/1.0-beta-7/plexus-i18n-1.0-beta-7.jar
Downloaded: http://dev.davidsoergel.com/nexus/content/groups/public/xml-apis/xml-apis/1.0.b2/xml-apis-1.0.b2.jar (107 KB at 1213.1 KB/sec)
Downloading: http://dev.davidsoergel.com/nexus/content/groups/public/org/codehaus/plexus/plexus-velocity/1.1.7/plexus-velocity-1.1.7.jar
Downloaded: http://dev.davidsoergel.com/nexus/content/groups/public/org/apache/maven/doxia/doxia-core/1.0/doxia-core-1.0.jar (54 KB at 365.0 KB/sec)
Downloading: http://dev.davidsoergel.com/nexus/content/groups/public/org/apache/velocity/velocity/1.5/velocity-1.5.jar
Downloaded: http://dev.davidsoergel.com/nexus/content/groups/public/org/apache/maven/doxia/doxia-site-renderer/1.0/doxia-site-renderer-1.0.jar (46 KB at 309.0 KB/sec)
Downloading: http://dev.davidsoergel.com/nexus/content/groups/public/org/apache/maven/doxia/doxia-decoration-model/1.0/doxia-decoration-model-1.0.jar
Downloaded: http://dev.davidsoergel.com/nexus/content/groups/public/org/codehaus/plexus/plexus-i18n/1.0-beta-7/plexus-i18n-1.0-beta-7.jar (11 KB at 60.4 KB/sec)
Downloading: http://dev.davidsoergel.com/nexus/content/groups/public/commons-collections/commons-collections/3.2/commons-collections-3.2.jar
Downloaded: http://dev.davidsoergel.com/nexus/content/groups/public/org/codehaus/plexus/plexus-velocity/1.1.7/plexus-velocity-1.1.7.jar (8 KB at 45.9 KB/sec)
Downloading: http://dev.davidsoergel.com/nexus/content/groups/public/org/apache/maven/doxia/doxia-module-apt/1.0/doxia-module-apt-1.0.jar
Downloaded: http://dev.davidsoergel.com/nexus/content/groups/public/org/apache/maven/doxia/doxia-decoration-model/1.0/doxia-decoration-model-1.0.jar (48 KB at 321.1 KB/sec)
Downloading: http://dev.davidsoergel.com/nexus/content/groups/public/org/apache/maven/doxia/doxia-module-fml/1.0/doxia-module-fml-1.0.jar
Downloaded: http://dev.davidsoergel.com/nexus/content/groups/public/org/apache/velocity/velocity/1.5/velocity-1.5.jar (383 KB at 1717.2 KB/sec)
Downloading: http://dev.davidsoergel.com/nexus/content/groups/public/org/apache/maven/doxia/doxia-module-xdoc/1.0/doxia-module-xdoc-1.0.jar
Downloaded: http://dev.davidsoergel.com/nexus/content/groups/public/commons-validator/commons-validator/1.2.0/commons-validator-1.2.0.jar (89 KB at 175.5 KB/sec)
Downloading: http://dev.davidsoergel.com/nexus/content/groups/public/org/apache/maven/doxia/doxia-module-xhtml/1.0/doxia-module-xhtml-1.0.jar
Downloaded: http://dev.davidsoergel.com/nexus/content/groups/public/org/apache/maven/doxia/doxia-module-apt/1.0/doxia-module-apt-1.0.jar (46 KB at 234.6 KB/sec)
Downloading: http://dev.davidsoergel.com/nexus/content/groups/public/commons-lang/commons-lang/2.4/commons-lang-2.4.jar
Downloaded: http://dev.davidsoergel.com/nexus/content/groups/public/org/apache/maven/doxia/doxia-module-fml/1.0/doxia-module-fml-1.0.jar (19 KB at 218.2 KB/sec)
Downloading: http://dev.davidsoergel.com/nexus/content/groups/public/org/codehaus/plexus/plexus-utils/2.0.2/plexus-utils-2.0.2.jar
Downloaded: http://dev.davidsoergel.com/nexus/content/groups/public/commons-collections/commons-collections/3.2/commons-collections-3.2.jar (558 KB at 2479.4 KB/sec)
Downloading: http://dev.davidsoergel.com/nexus/content/groups/public/org/apache/maven/shared/maven-invoker/2.0.11/maven-invoker-2.0.11.jar
Downloaded: http://dev.davidsoergel.com/nexus/content/groups/public/org/apache/maven/doxia/doxia-module-xhtml/1.0/doxia-module-xhtml-1.0.jar (22 KB at 180.5 KB/sec)
Downloaded: http://dev.davidsoergel.com/nexus/content/groups/public/org/apache/maven/shared/maven-invoker/2.0.11/maven-invoker-2.0.11.jar (29 KB at 114.8 KB/sec)
Downloaded: http://dev.davidsoergel.com/nexus/content/groups/public/commons-lang/commons-lang/2.4/commons-lang-2.4.jar (256 KB at 903.4 KB/sec)
Downloaded: http://dev.davidsoergel.com/nexus/content/groups/public/org/codehaus/plexus/plexus-utils/2.0.2/plexus-utils-2.0.2.jar (218 KB at 773.8 KB/sec)
Downloaded: http://dev.davidsoergel.com/nexus/content/groups/public/org/apache/maven/doxia/doxia-module-xdoc/1.0/doxia-module-xdoc-1.0.jar (28 KB at 74.6 KB/sec)
mojoSucceeded org.codehaus.mojo:cobertura-maven-plugin:2.5.1(clean)
Dec 2, 2012 2:05:57 AM hudson.maven.ExecutedMojo <init>
WARNING: Failed to getClass for org.apache.maven.plugin.source.SourceJarMojo
mojoStarted org.apache.maven.plugins:maven-source-plugin:2.2.1(default-cli)
[INFO] 
[INFO] --- maven-source-plugin:2.2.1:jar (default-cli) @ dsutils ---
Downloading: http://dev.davidsoergel.com/nexus/content/groups/public/org/apache/maven/maven-model/2.0.9/maven-model-2.0.9.pom
Downloaded: http://dev.davidsoergel.com/nexus/content/groups/public/org/apache/maven/maven-model/2.0.9/maven-model-2.0.9.pom (4 KB at 52.9 KB/sec)
Downloading: http://dev.davidsoergel.com/nexus/content/groups/public/org/apache/maven/maven/2.0.9/maven-2.0.9.pom
Downloaded: http://dev.davidsoergel.com/nexus/content/groups/public/org/apache/maven/maven/2.0.9/maven-2.0.9.pom (19 KB at 205.2 KB/sec)
Downloading: http://dev.davidsoergel.com/nexus/content/groups/public/org/apache/maven/maven-parent/8/maven-parent-8.pom
Downloaded: http://dev.davidsoergel.com/nexus/content/groups/public/org/apache/maven/maven-parent/8/maven-parent-8.pom (24 KB at 406.3 KB/sec)
Downloading: http://dev.davidsoergel.com/nexus/content/groups/public/org/codehaus/plexus/plexus-utils/1.5.1/plexus-utils-1.5.1.pom
Downloaded: http://dev.davidsoergel.com/nexus/content/groups/public/org/codehaus/plexus/plexus-utils/1.5.1/plexus-utils-1.5.1.pom (3 KB at 42.3 KB/sec)
Downloading: http://dev.davidsoergel.com/nexus/content/groups/public/org/apache/maven/maven-artifact/2.0.9/maven-artifact-2.0.9.pom
Downloaded: http://dev.davidsoergel.com/nexus/content/groups/public/org/apache/maven/maven-artifact/2.0.9/maven-artifact-2.0.9.pom (2 KB at 20.0 KB/sec)
Downloading: http://dev.davidsoergel.com/nexus/content/groups/public/org/apache/maven/maven-plugin-api/2.0.9/maven-plugin-api-2.0.9.pom
Downloaded: http://dev.davidsoergel.com/nexus/content/groups/public/org/apache/maven/maven-plugin-api/2.0.9/maven-plugin-api-2.0.9.pom (2 KB at 31.0 KB/sec)
Downloading: http://dev.davidsoergel.com/nexus/content/groups/public/org/apache/maven/maven-project/2.0.9/maven-project-2.0.9.pom
Downloaded: http://dev.davidsoergel.com/nexus/content/groups/public/org/apache/maven/maven-project/2.0.9/maven-project-2.0.9.pom (3 KB at 22.1 KB/sec)
Downloading: http://dev.davidsoergel.com/nexus/content/groups/public/org/apache/maven/maven-settings/2.0.9/maven-settings-2.0.9.pom
Downloaded: http://dev.davidsoergel.com/nexus/content/groups/public/org/apache/maven/maven-settings/2.0.9/maven-settings-2.0.9.pom (3 KB at 35.3 KB/sec)
Downloading: http://dev.davidsoergel.com/nexus/content/groups/public/org/apache/maven/maven-profile/2.0.9/maven-profile-2.0.9.pom
Downloaded: http://dev.davidsoergel.com/nexus/content/groups/public/org/apache/maven/maven-profile/2.0.9/maven-profile-2.0.9.pom (3 KB at 33.4 KB/sec)
Downloading: http://dev.davidsoergel.com/nexus/content/groups/public/org/apache/maven/maven-artifact-manager/2.0.9/maven-artifact-manager-2.0.9.pom
Downloaded: http://dev.davidsoergel.com/nexus/content/groups/public/org/apache/maven/maven-artifact-manager/2.0.9/maven-artifact-manager-2.0.9.pom (3 KB at 29.6 KB/sec)
Downloading: http://dev.davidsoergel.com/nexus/content/groups/public/org/apache/maven/maven-repository-metadata/2.0.9/maven-repository-metadata-2.0.9.pom
Downloaded: http://dev.davidsoergel.com/nexus/content/groups/public/org/apache/maven/maven-repository-metadata/2.0.9/maven-repository-metadata-2.0.9.pom (2 KB at 39.5 KB/sec)
Downloading: http://dev.davidsoergel.com/nexus/content/groups/public/org/apache/maven/maven-plugin-registry/2.0.9/maven-plugin-registry-2.0.9.pom
Downloaded: http://dev.davidsoergel.com/nexus/content/groups/public/org/apache/maven/maven-plugin-registry/2.0.9/maven-plugin-registry-2.0.9.pom (2 KB at 35.0 KB/sec)
Downloading: http://dev.davidsoergel.com/nexus/content/groups/public/org/apache/maven/maven-archiver/2.5/maven-archiver-2.5.pom
Downloaded: http://dev.davidsoergel.com/nexus/content/groups/public/org/apache/maven/maven-archiver/2.5/maven-archiver-2.5.pom (5 KB at 11.9 KB/sec)
Downloading: http://dev.davidsoergel.com/nexus/content/groups/public/org/apache/maven/shared/maven-shared-components/17/maven-shared-components-17.pom
Downloaded: http://dev.davidsoergel.com/nexus/content/groups/public/org/apache/maven/shared/maven-shared-components/17/maven-shared-components-17.pom (9 KB at 60.7 KB/sec)
Downloading: http://dev.davidsoergel.com/nexus/content/groups/public/org/apache/maven/maven-artifact/2.0.6/maven-artifact-2.0.6.pom
Downloaded: http://dev.davidsoergel.com/nexus/content/groups/public/org/apache/maven/maven-artifact/2.0.6/maven-artifact-2.0.6.pom (2 KB at 57.0 KB/sec)
Downloading: http://dev.davidsoergel.com/nexus/content/groups/public/org/apache/maven/maven-model/2.0.6/maven-model-2.0.6.pom
Downloaded: http://dev.davidsoergel.com/nexus/content/groups/public/org/apache/maven/maven-model/2.0.6/maven-model-2.0.6.pom (3 KB at 19.0 KB/sec)
Downloading: http://dev.davidsoergel.com/nexus/content/groups/public/org/apache/maven/maven-core/2.0.6/maven-core-2.0.6.pom
Downloaded: http://dev.davidsoergel.com/nexus/content/groups/public/org/apache/maven/maven-core/2.0.6/maven-core-2.0.6.pom (7 KB at 226.0 KB/sec)
Downloading: http://dev.davidsoergel.com/nexus/content/groups/public/org/apache/maven/maven-settings/2.0.6/maven-settings-2.0.6.pom
Downloaded: http://dev.davidsoergel.com/nexus/content/groups/public/org/apache/maven/maven-settings/2.0.6/maven-settings-2.0.6.pom (2 KB at 43.4 KB/sec)
Downloading: http://dev.davidsoergel.com/nexus/content/groups/public/org/apache/maven/maven-plugin-parameter-documenter/2.0.6/maven-plugin-parameter-documenter-2.0.6.pom
Downloaded: http://dev.davidsoergel.com/nexus/content/groups/public/org/apache/maven/maven-plugin-parameter-documenter/2.0.6/maven-plugin-parameter-documenter-2.0.6.pom (2 KB at 16.8 KB/sec)
Downloading: http://dev.davidsoergel.com/nexus/content/groups/public/org/apache/maven/reporting/maven-reporting-api/2.0.6/maven-reporting-api-2.0.6.pom
Downloaded: http://dev.davidsoergel.com/nexus/content/groups/public/org/apache/maven/reporting/maven-reporting-api/2.0.6/maven-reporting-api-2.0.6.pom (2 KB at 6.8 KB/sec)
Downloading: http://dev.davidsoergel.com/nexus/content/groups/public/org/apache/maven/reporting/maven-reporting/2.0.6/maven-reporting-2.0.6.pom
Downloaded: http://dev.davidsoergel.com/nexus/content/groups/public/org/apache/maven/reporting/maven-reporting/2.0.6/maven-reporting-2.0.6.pom (2 KB at 10.2 KB/sec)
Downloading: http://dev.davidsoergel.com/nexus/content/groups/public/org/apache/maven/maven-profile/2.0.6/maven-profile-2.0.6.pom
Downloaded: http://dev.davidsoergel.com/nexus/content/groups/public/org/apache/maven/maven-profile/2.0.6/maven-profile-2.0.6.pom (2 KB at 26.5 KB/sec)
Downloading: http://dev.davidsoergel.com/nexus/content/groups/public/org/apache/maven/maven-repository-metadata/2.0.6/maven-repository-metadata-2.0.6.pom
Downloaded: http://dev.davidsoergel.com/nexus/content/groups/public/org/apache/maven/maven-repository-metadata/2.0.6/maven-repository-metadata-2.0.6.pom (2 KB at 31.7 KB/sec)
Downloading: http://dev.davidsoergel.com/nexus/content/groups/public/org/apache/maven/maven-error-diagnostics/2.0.6/maven-error-diagnostics-2.0.6.pom
Downloaded: http://dev.davidsoergel.com/nexus/content/groups/public/org/apache/maven/maven-error-diagnostics/2.0.6/maven-error-diagnostics-2.0.6.pom (2 KB at 30.8 KB/sec)
Downloading: http://dev.davidsoergel.com/nexus/content/groups/public/org/apache/maven/maven-project/2.0.6/maven-project-2.0.6.pom
Downloaded: http://dev.davidsoergel.com/nexus/content/groups/public/org/apache/maven/maven-project/2.0.6/maven-project-2.0.6.pom (3 KB at 56.0 KB/sec)
Downloading: http://dev.davidsoergel.com/nexus/content/groups/public/org/apache/maven/maven-artifact-manager/2.0.6/maven-artifact-manager-2.0.6.pom
Downloaded: http://dev.davidsoergel.com/nexus/content/groups/public/org/apache/maven/maven-artifact-manager/2.0.6/maven-artifact-manager-2.0.6.pom (3 KB at 19.5 KB/sec)
Downloading: http://dev.davidsoergel.com/nexus/content/groups/public/org/apache/maven/maven-plugin-registry/2.0.6/maven-plugin-registry-2.0.6.pom
Downloaded: http://dev.davidsoergel.com/nexus/content/groups/public/org/apache/maven/maven-plugin-registry/2.0.6/maven-plugin-registry-2.0.6.pom (2 KB at 31.2 KB/sec)
Downloading: http://dev.davidsoergel.com/nexus/content/groups/public/org/apache/maven/maven-plugin-descriptor/2.0.6/maven-plugin-descriptor-2.0.6.pom
Downloaded: http://dev.davidsoergel.com/nexus/content/groups/public/org/apache/maven/maven-plugin-descriptor/2.0.6/maven-plugin-descriptor-2.0.6.pom (2 KB at 16.8 KB/sec)
Downloading: http://dev.davidsoergel.com/nexus/content/groups/public/org/apache/maven/maven-monitor/2.0.6/maven-monitor-2.0.6.pom
Downloaded: http://dev.davidsoergel.com/nexus/content/groups/public/org/apache/maven/maven-monitor/2.0.6/maven-monitor-2.0.6.pom (2 KB at 16.1 KB/sec)
Downloading: http://dev.davidsoergel.com/nexus/content/groups/public/org/codehaus/plexus/plexus-archiver/2.1/plexus-archiver-2.1.pom
Downloaded: http://dev.davidsoergel.com/nexus/content/groups/public/org/codehaus/plexus/plexus-archiver/2.1/plexus-archiver-2.1.pom (3 KB at 35.6 KB/sec)
Downloading: http://dev.davidsoergel.com/nexus/content/groups/public/org/sonatype/spice/spice-parent/17/spice-parent-17.pom
Downloaded: http://dev.davidsoergel.com/nexus/content/groups/public/org/sonatype/spice/spice-parent/17/spice-parent-17.pom (7 KB at 108.2 KB/sec)
Downloading: http://dev.davidsoergel.com/nexus/content/groups/public/org/sonatype/forge/forge-parent/10/forge-parent-10.pom
Downloaded: http://dev.davidsoergel.com/nexus/content/groups/public/org/sonatype/forge/forge-parent/10/forge-parent-10.pom (14 KB at 236.5 KB/sec)
Downloading: http://dev.davidsoergel.com/nexus/content/groups/public/org/codehaus/plexus/plexus-utils/3.0/plexus-utils-3.0.pom
Downloaded: http://dev.davidsoergel.com/nexus/content/groups/public/org/codehaus/plexus/plexus-utils/3.0/plexus-utils-3.0.pom (4 KB at 39.3 KB/sec)
Downloading: http://dev.davidsoergel.com/nexus/content/groups/public/org/sonatype/spice/spice-parent/16/spice-parent-16.pom
Downloaded: http://dev.davidsoergel.com/nexus/content/groups/public/org/sonatype/spice/spice-parent/16/spice-parent-16.pom (9 KB at 52.7 KB/sec)
Downloading: http://dev.davidsoergel.com/nexus/content/groups/public/org/sonatype/forge/forge-parent/5/forge-parent-5.pom
Downloaded: http://dev.davidsoergel.com/nexus/content/groups/public/org/sonatype/forge/forge-parent/5/forge-parent-5.pom (9 KB at 63.3 KB/sec)
Downloading: http://dev.davidsoergel.com/nexus/content/groups/public/org/codehaus/plexus/plexus-io/2.0.2/plexus-io-2.0.2.pom
Downloaded: http://dev.davidsoergel.com/nexus/content/groups/public/org/codehaus/plexus/plexus-io/2.0.2/plexus-io-2.0.2.pom (2 KB at 27.7 KB/sec)
Downloading: http://dev.davidsoergel.com/nexus/content/groups/public/org/codehaus/plexus/plexus-components/1.1.19/plexus-components-1.1.19.pom
Downloaded: http://dev.davidsoergel.com/nexus/content/groups/public/org/codehaus/plexus/plexus-components/1.1.19/plexus-components-1.1.19.pom (3 KB at 21.8 KB/sec)
Downloading: http://dev.davidsoergel.com/nexus/content/groups/public/org/codehaus/plexus/plexus/3.0.1/plexus-3.0.1.pom
Downloaded: http://dev.davidsoergel.com/nexus/content/groups/public/org/codehaus/plexus/plexus/3.0.1/plexus-3.0.1.pom (19 KB at 267.3 KB/sec)
Downloading: http://dev.davidsoergel.com/nexus/content/groups/public/org/codehaus/plexus/plexus-interpolation/1.15/plexus-interpolation-1.15.pom
Downloaded: http://dev.davidsoergel.com/nexus/content/groups/public/org/codehaus/plexus/plexus-interpolation/1.15/plexus-interpolation-1.15.pom (1018 B at 16.8 KB/sec)
Downloading: http://dev.davidsoergel.com/nexus/content/groups/public/org/codehaus/plexus/plexus-archiver/2.2/plexus-archiver-2.2.pom
Downloaded: http://dev.davidsoergel.com/nexus/content/groups/public/org/codehaus/plexus/plexus-archiver/2.2/plexus-archiver-2.2.pom (4 KB at 40.7 KB/sec)
Downloading: http://dev.davidsoergel.com/nexus/content/groups/public/org/codehaus/plexus/plexus-components/1.1.20/plexus-components-1.1.20.pom
Downloaded: http://dev.davidsoergel.com/nexus/content/groups/public/org/codehaus/plexus/plexus-components/1.1.20/plexus-components-1.1.20.pom (3 KB at 48.3 KB/sec)
Downloading: http://dev.davidsoergel.com/nexus/content/groups/public/org/codehaus/plexus/plexus/3.1/plexus-3.1.pom
Downloaded: http://dev.davidsoergel.com/nexus/content/groups/public/org/codehaus/plexus/plexus/3.1/plexus-3.1.pom (19 KB at 128.9 KB/sec)
Downloading: http://dev.davidsoergel.com/nexus/content/groups/public/org/codehaus/plexus/plexus-utils/3.0.7/plexus-utils-3.0.7.pom
Downloaded: http://dev.davidsoergel.com/nexus/content/groups/public/org/codehaus/plexus/plexus-utils/3.0.7/plexus-utils-3.0.7.pom (3 KB at 62.9 KB/sec)
Downloading: http://dev.davidsoergel.com/nexus/content/groups/public/org/codehaus/plexus/plexus-io/2.0.4/plexus-io-2.0.4.pom
Downloaded: http://dev.davidsoergel.com/nexus/content/groups/public/org/codehaus/plexus/plexus-io/2.0.4/plexus-io-2.0.4.pom (2 KB at 13.8 KB/sec)
Downloading: http://dev.davidsoergel.com/nexus/content/groups/public/org/codehaus/plexus/plexus-utils/3.0.8/plexus-utils-3.0.8.pom
Downloaded: http://dev.davidsoergel.com/nexus/content/groups/public/org/codehaus/plexus/plexus-utils/3.0.8/plexus-utils-3.0.8.pom (4 KB at 18.8 KB/sec)
Downloading: http://dev.davidsoergel.com/nexus/content/groups/public/org/codehaus/plexus/plexus/3.2/plexus-3.2.pom
Downloaded: http://dev.davidsoergel.com/nexus/content/groups/public/org/codehaus/plexus/plexus/3.2/plexus-3.2.pom (19 KB at 107.1 KB/sec)
Downloading: http://dev.davidsoergel.com/nexus/content/groups/public/org/apache/maven/maven-archiver/2.5/maven-archiver-2.5.jar
Downloading: http://dev.davidsoergel.com/nexus/content/groups/public/org/apache/maven/reporting/maven-reporting-api/2.0.6/maven-reporting-api-2.0.6.jar
Downloading: http://dev.davidsoergel.com/nexus/content/groups/public/org/apache/maven/doxia/doxia-sink-api/1.0-alpha-7/doxia-sink-api-1.0-alpha-7.jar
Downloading: http://dev.davidsoergel.com/nexus/content/groups/public/org/codehaus/plexus/plexus-interpolation/1.15/plexus-interpolation-1.15.jar
Downloading: http://dev.davidsoergel.com/nexus/content/groups/public/org/codehaus/plexus/plexus-archiver/2.2/plexus-archiver-2.2.jar
Downloaded: http://dev.davidsoergel.com/nexus/content/groups/public/org/apache/maven/maven-archiver/2.5/maven-archiver-2.5.jar (22 KB at 68.7 KB/sec)
Downloading: http://dev.davidsoergel.com/nexus/content/groups/public/org/codehaus/plexus/plexus-io/2.0.4/plexus-io-2.0.4.jar
Downloaded: http://dev.davidsoergel.com/nexus/content/groups/public/org/apache/maven/doxia/doxia-sink-api/1.0-alpha-7/doxia-sink-api-1.0-alpha-7.jar (6 KB at 16.4 KB/sec)
Downloading: http://dev.davidsoergel.com/nexus/content/groups/public/org/codehaus/plexus/plexus-utils/3.0.8/plexus-utils-3.0.8.jar
Downloaded: http://dev.davidsoergel.com/nexus/content/groups/public/org/codehaus/plexus/plexus-interpolation/1.15/plexus-interpolation-1.15.jar (60 KB at 144.4 KB/sec)
Downloaded: http://dev.davidsoergel.com/nexus/content/groups/public/org/codehaus/plexus/plexus-archiver/2.2/plexus-archiver-2.2.jar (181 KB at 554.1 KB/sec)
Downloaded: http://dev.davidsoergel.com/nexus/content/groups/public/org/apache/maven/reporting/maven-reporting-api/2.0.6/maven-reporting-api-2.0.6.jar (10 KB at 18.5 KB/sec)
Downloaded: http://dev.davidsoergel.com/nexus/content/groups/public/org/codehaus/plexus/plexus-io/2.0.4/plexus-io-2.0.4.jar (57 KB at 222.3 KB/sec)
Downloaded: http://dev.davidsoergel.com/nexus/content/groups/public/org/codehaus/plexus/plexus-utils/3.0.8/plexus-utils-3.0.8.jar (227 KB at 851.1 KB/sec)
[INFO] Building jar: /media/ephemeral0/workspace/dsutils/target/dsutils-1.06-SNAPSHOT-sources.jar
mojoSucceeded org.apache.maven.plugins:maven-source-plugin:2.2.1(default-cli)
mojoStarted org.apache.maven.plugins:maven-resources-plugin:2.5(default-resources)
[INFO] 
Downloading: http://dev.davidsoergel.com/nexus/content/groups/public/org/apache/maven/shared/maven-filtering/1.0/maven-filtering-1.0.pom
[INFO] --- maven-resources-plugin:2.5:resources (default-resources) @ dsutils ---
Downloaded: http://dev.davidsoergel.com/nexus/content/groups/public/org/apache/maven/shared/maven-filtering/1.0/maven-filtering-1.0.pom (6 KB at 47.7 KB/sec)
Downloading: http://dev.davidsoergel.com/nexus/content/groups/public/org/apache/maven/shared/maven-shared-components/16/maven-shared-components-16.pom
Downloaded: http://dev.davidsoergel.com/nexus/content/groups/public/org/apache/maven/shared/maven-shared-components/16/maven-shared-components-16.pom (9 KB at 103.9 KB/sec)
Downloading: http://dev.davidsoergel.com/nexus/content/groups/public/org/codehaus/plexus/plexus-utils/1.5.15/plexus-utils-1.5.15.pom
Downloaded: http://dev.davidsoergel.com/nexus/content/groups/public/org/codehaus/plexus/plexus-utils/1.5.15/plexus-utils-1.5.15.pom (7 KB at 257.2 KB/sec)
Downloading: http://dev.davidsoergel.com/nexus/content/groups/public/org/codehaus/plexus/plexus-interpolation/1.12/plexus-interpolation-1.12.pom
Downloaded: http://dev.davidsoergel.com/nexus/content/groups/public/org/codehaus/plexus/plexus-interpolation/1.12/plexus-interpolation-1.12.pom (889 B at 31.0 KB/sec)
Downloading: http://dev.davidsoergel.com/nexus/content/groups/public/org/codehaus/plexus/plexus-components/1.1.14/plexus-components-1.1.14.pom
Downloaded: http://dev.davidsoergel.com/nexus/content/groups/public/org/codehaus/plexus/plexus-components/1.1.14/plexus-components-1.1.14.pom (6 KB at 69.6 KB/sec)
Downloading: http://dev.davidsoergel.com/nexus/content/groups/public/org/sonatype/plexus/plexus-build-api/0.0.4/plexus-build-api-0.0.4.pom
Downloaded: http://dev.davidsoergel.com/nexus/content/groups/public/org/sonatype/plexus/plexus-build-api/0.0.4/plexus-build-api-0.0.4.pom (3 KB at 49.1 KB/sec)
Downloading: http://dev.davidsoergel.com/nexus/content/groups/public/org/sonatype/spice/spice-parent/10/spice-parent-10.pom
Downloaded: http://dev.davidsoergel.com/nexus/content/groups/public/org/sonatype/spice/spice-parent/10/spice-parent-10.pom (3 KB at 45.3 KB/sec)
Downloading: http://dev.davidsoergel.com/nexus/content/groups/public/org/sonatype/forge/forge-parent/3/forge-parent-3.pom
Downloaded: http://dev.davidsoergel.com/nexus/content/groups/public/org/sonatype/forge/forge-parent/3/forge-parent-3.pom (5 KB at 57.2 KB/sec)
Downloading: http://dev.davidsoergel.com/nexus/content/groups/public/org/codehaus/plexus/plexus-utils/1.5.8/plexus-utils-1.5.8.pom
Downloaded: http://dev.davidsoergel.com/nexus/content/groups/public/org/codehaus/plexus/plexus-utils/1.5.8/plexus-utils-1.5.8.pom (8 KB at 143.2 KB/sec)
Downloading: http://dev.davidsoergel.com/nexus/content/groups/public/org/codehaus/plexus/plexus-interpolation/1.13/plexus-interpolation-1.13.pom
Downloaded: http://dev.davidsoergel.com/nexus/content/groups/public/org/codehaus/plexus/plexus-interpolation/1.13/plexus-interpolation-1.13.pom (890 B at 16.4 KB/sec)
Downloading: http://dev.davidsoergel.com/nexus/content/groups/public/org/codehaus/plexus/plexus-components/1.1.15/plexus-components-1.1.15.pom
Downloaded: http://dev.davidsoergel.com/nexus/content/groups/public/org/codehaus/plexus/plexus-components/1.1.15/plexus-components-1.1.15.pom (3 KB at 33.1 KB/sec)
Downloading: http://dev.davidsoergel.com/nexus/content/groups/public/org/codehaus/plexus/plexus/2.0.3/plexus-2.0.3.pom
Downloaded: http://dev.davidsoergel.com/nexus/content/groups/public/org/codehaus/plexus/plexus/2.0.3/plexus-2.0.3.pom (16 KB at 255.9 KB/sec)
Downloading: http://dev.davidsoergel.com/nexus/content/groups/public/org/apache/maven/shared/maven-filtering/1.0/maven-filtering-1.0.jar
Downloading: http://dev.davidsoergel.com/nexus/content/groups/public/org/sonatype/plexus/plexus-build-api/0.0.4/plexus-build-api-0.0.4.jar
Downloading: http://dev.davidsoergel.com/nexus/content/groups/public/org/codehaus/plexus/plexus-interpolation/1.13/plexus-interpolation-1.13.jar
Downloaded: http://dev.davidsoergel.com/nexus/content/groups/public/org/sonatype/plexus/plexus-build-api/0.0.4/plexus-build-api-0.0.4.jar (7 KB at 86.4 KB/sec)
Downloaded: http://dev.davidsoergel.com/nexus/content/groups/public/org/apache/maven/shared/maven-filtering/1.0/maven-filtering-1.0.jar (42 KB at 524.1 KB/sec)
Downloaded: http://dev.davidsoergel.com/nexus/content/groups/public/org/codehaus/plexus/plexus-interpolation/1.13/plexus-interpolation-1.13.jar (60 KB at 368.1 KB/sec)
[debug] execute contextualize
[INFO] Using 'UTF-8' encoding to copy filtered resources.
[INFO] skip non existing resourceDirectory /media/ephemeral0/workspace/dsutils/src/main/resources
mojoSucceeded org.apache.maven.plugins:maven-resources-plugin:2.5(default-resources)
mojoStarted org.apache.maven.plugins:maven-compiler-plugin:2.4(default-compile)
[INFO] 
[INFO] --- maven-compiler-plugin:2.4:compile (default-compile) @ dsutils ---
Downloading: http://dev.davidsoergel.com/nexus/content/groups/public/org/apache/maven/maven-core/2.0.9/maven-core-2.0.9.pom
Downloaded: http://dev.davidsoergel.com/nexus/content/groups/public/org/apache/maven/maven-core/2.0.9/maven-core-2.0.9.pom (8 KB at 128.9 KB/sec)
Downloading: http://dev.davidsoergel.com/nexus/content/groups/public/org/apache/maven/maven-plugin-parameter-documenter/2.0.9/maven-plugin-parameter-documenter-2.0.9.pom
Downloaded: http://dev.davidsoergel.com/nexus/content/groups/public/org/apache/maven/maven-plugin-parameter-documenter/2.0.9/maven-plugin-parameter-documenter-2.0.9.pom (2 KB at 39.1 KB/sec)
Downloading: http://dev.davidsoergel.com/nexus/content/groups/public/org/apache/maven/maven-error-diagnostics/2.0.9/maven-error-diagnostics-2.0.9.pom
Downloaded: http://dev.davidsoergel.com/nexus/content/groups/public/org/apache/maven/maven-error-diagnostics/2.0.9/maven-error-diagnostics-2.0.9.pom (2 KB at 8.3 KB/sec)
Downloading: http://dev.davidsoergel.com/nexus/content/groups/public/org/apache/maven/maven-plugin-descriptor/2.0.9/maven-plugin-descriptor-2.0.9.pom
Downloaded: http://dev.davidsoergel.com/nexus/content/groups/public/org/apache/maven/maven-plugin-descriptor/2.0.9/maven-plugin-descriptor-2.0.9.pom (3 KB at 15.8 KB/sec)
Downloading: http://dev.davidsoergel.com/nexus/content/groups/public/org/apache/maven/maven-monitor/2.0.9/maven-monitor-2.0.9.pom
Downloaded: http://dev.davidsoergel.com/nexus/content/groups/public/org/apache/maven/maven-monitor/2.0.9/maven-monitor-2.0.9.pom (2 KB at 3.9 KB/sec)
Downloading: http://dev.davidsoergel.com/nexus/content/groups/public/org/apache/maven/maven-toolchain/1.0/maven-toolchain-1.0.pom
Downloaded: http://dev.davidsoergel.com/nexus/content/groups/public/org/apache/maven/maven-toolchain/1.0/maven-toolchain-1.0.pom (4 KB at 42.7 KB/sec)
Downloading: http://dev.davidsoergel.com/nexus/content/groups/public/org/codehaus/plexus/plexus-compiler-api/1.8.6/plexus-compiler-api-1.8.6.pom
Downloaded: http://dev.davidsoergel.com/nexus/content/groups/public/org/codehaus/plexus/plexus-compiler-api/1.8.6/plexus-compiler-api-1.8.6.pom (780 B at 23.1 KB/sec)
Downloading: http://dev.davidsoergel.com/nexus/content/groups/public/org/codehaus/plexus/plexus-compiler/1.8.6/plexus-compiler-1.8.6.pom
Downloaded: http://dev.davidsoergel.com/nexus/content/groups/public/org/codehaus/plexus/plexus-compiler/1.8.6/plexus-compiler-1.8.6.pom (4 KB at 28.3 KB/sec)
Downloading: http://dev.davidsoergel.com/nexus/content/groups/public/org/codehaus/plexus/plexus-compiler-manager/1.8.6/plexus-compiler-manager-1.8.6.pom
Downloaded: http://dev.davidsoergel.com/nexus/content/groups/public/org/codehaus/plexus/plexus-compiler-manager/1.8.6/plexus-compiler-manager-1.8.6.pom (692 B at 11.9 KB/sec)
Downloading: http://dev.davidsoergel.com/nexus/content/groups/public/org/codehaus/plexus/plexus-compiler-javac/1.8.6/plexus-compiler-javac-1.8.6.pom
Downloaded: http://dev.davidsoergel.com/nexus/content/groups/public/org/codehaus/plexus/plexus-compiler-javac/1.8.6/plexus-compiler-javac-1.8.6.pom (688 B at 11.8 KB/sec)
Downloading: http://dev.davidsoergel.com/nexus/content/groups/public/org/codehaus/plexus/plexus-compilers/1.8.6/plexus-compilers-1.8.6.pom
Downloaded: http://dev.davidsoergel.com/nexus/content/groups/public/org/codehaus/plexus/plexus-compilers/1.8.6/plexus-compilers-1.8.6.pom (2 KB at 14.8 KB/sec)
Downloading: http://dev.davidsoergel.com/nexus/content/groups/public/org/codehaus/plexus/plexus-utils/3.0/plexus-utils-3.0.jar
Downloading: http://dev.davidsoergel.com/nexus/content/groups/public/org/codehaus/plexus/plexus-compiler-api/1.8.6/plexus-compiler-api-1.8.6.jar
Downloading: http://dev.davidsoergel.com/nexus/content/groups/public/org/codehaus/plexus/plexus-compiler-manager/1.8.6/plexus-compiler-manager-1.8.6.jar
Downloading: http://dev.davidsoergel.com/nexus/content/groups/public/org/codehaus/plexus/plexus-compiler-javac/1.8.6/plexus-compiler-javac-1.8.6.jar
Downloaded: http://dev.davidsoergel.com/nexus/content/groups/public/org/codehaus/plexus/plexus-compiler-api/1.8.6/plexus-compiler-api-1.8.6.jar (19 KB at 177.7 KB/sec)
Downloaded: http://dev.davidsoergel.com/nexus/content/groups/public/org/codehaus/plexus/plexus-compiler-manager/1.8.6/plexus-compiler-manager-1.8.6.jar (5 KB at 40.6 KB/sec)
Downloaded: http://dev.davidsoergel.com/nexus/content/groups/public/org/codehaus/plexus/plexus-compiler-javac/1.8.6/plexus-compiler-javac-1.8.6.jar (13 KB at 85.3 KB/sec)
Downloaded: http://dev.davidsoergel.com/nexus/content/groups/public/org/codehaus/plexus/plexus-utils/3.0/plexus-utils-3.0.jar (221 KB at 1247.3 KB/sec)
[INFO] Compiling 152 source files to /media/ephemeral0/workspace/dsutils/target/classes
[INFO] -------------------------------------------------------------
[ERROR] COMPILATION ERROR : 
mojoFailed org.apache.maven.plugins:maven-compiler-plugin:2.4(default-compile)[INFO] -------------------------------------------------------------
[ERROR] Failure executing javac, but could not parse the error:
javac: invalid target release: 1.7
Usage: javac <options> <source files>
use -help for a list of possible options

[INFO] 1 error
[INFO] -------------------------------------------------------------

projectFailed com.davidsoergel:dsutils:1.06-SNAPSHOT
sessionEnded
[INFO] ------------------------------------------------------------------------
[INFO] BUILD FAILURE
[INFO] ------------------------------------------------------------------------
[INFO] Total time: 1:10.570s
[INFO] Finished at: Sun Dec 02 02:06:11 UTC 2012
[INFO] Final Memory: 10M/25M
[INFO] ------------------------------------------------------------------------
Projects to build: [MavenProject: com.davidsoergel:dsutils:1.06-SNAPSHOT @ /media/ephemeral0/workspace/dsutils/pom.xml]
[JENKINS] Archiving /media/ephemeral0/workspace/dsutils/pom.xml to /usr/share/apache-tomcat-7.0.22/.jenkins/jobs/dsutils/modules/com.davidsoergel$dsutils/builds/2012-12-01_21-04-50/archive/com.davidsoergel/dsutils/1.06-SNAPSHOT/dsutils-1.06-SNAPSHOT.pom
[JENKINS] Archiving /media/ephemeral0/workspace/dsutils/target/dsutils-1.06-SNAPSHOT-sources.jar to /usr/share/apache-tomcat-7.0.22/.jenkins/jobs/dsutils/modules/com.davidsoergel$dsutils/builds/2012-12-01_21-04-50/archive/com.davidsoergel/dsutils/1.06-SNAPSHOT/dsutils-1.06-SNAPSHOT-sources.jar
Waiting for Jenkins to finish collecting data
mavenExecutionResult exceptions not empty
message : Failed to execute goal org.apache.maven.plugins:maven-compiler-plugin:2.4:compile (default-compile) on project dsutils: Compilation failure
Failure executing javac, but could not parse the error:
javac: invalid target release: 1.7
Usage: javac <options> <source files>
use -help for a list of possible options


cause : Compilation failure
Failure executing javac, but could not parse the error:
javac: invalid target release: 1.7
Usage: javac <options> <source files>
use -help for a list of possible options


Stack trace : 
org.apache.maven.lifecycle.LifecycleExecutionException: Failed to execute goal org.apache.maven.plugins:maven-compiler-plugin:2.4:compile (default-compile) on project dsutils: Compilation failure
Failure executing javac, but could not parse the error:
javac: invalid target release: 1.7
Usage: javac <options> <source files>
use -help for a list of possible options


	at org.apache.maven.lifecycle.internal.MojoExecutor.execute(MojoExecutor.java:213)
	at org.apache.maven.lifecycle.internal.MojoExecutor.execute(MojoExecutor.java:153)
	at org.apache.maven.lifecycle.internal.MojoExecutor.execute(MojoExecutor.java:145)
	at org.apache.maven.lifecycle.internal.LifecycleModuleBuilder.buildProject(LifecycleModuleBuilder.java:84)
	at org.apache.maven.lifecycle.internal.LifecycleModuleBuilder.buildProject(LifecycleModuleBuilder.java:59)
	at org.apache.maven.lifecycle.internal.LifecycleStarter.singleThreadedBuild(LifecycleStarter.java:183)
	at org.apache.maven.lifecycle.internal.LifecycleStarter.execute(LifecycleStarter.java:161)
	at org.apache.maven.DefaultMaven.doExecute(DefaultMaven.java:320)
	at org.apache.maven.DefaultMaven.execute(DefaultMaven.java:156)
	at org.jvnet.hudson.maven3.launcher.Maven3Launcher.main(Maven3Launcher.java:79)
	at sun.reflect.NativeMethodAccessorImpl.invoke0(Native Method)
	at sun.reflect.NativeMethodAccessorImpl.invoke(NativeMethodAccessorImpl.java:39)
	at sun.reflect.DelegatingMethodAccessorImpl.invoke(DelegatingMethodAccessorImpl.java:25)
	at java.lang.reflect.Method.invoke(Method.java:597)
	at org.codehaus.plexus.classworlds.launcher.Launcher.launchStandard(Launcher.java:329)
	at org.codehaus.plexus.classworlds.launcher.Launcher.launch(Launcher.java:239)
	at org.jvnet.hudson.maven3.agent.Maven3Main.launch(Maven3Main.java:158)
	at hudson.maven.Maven3Builder.call(Maven3Builder.java:98)
	at hudson.maven.Maven3Builder.call(Maven3Builder.java:64)
	at hudson.remoting.UserRequest.perform(UserRequest.java:118)
	at hudson.remoting.UserRequest.perform(UserRequest.java:48)
	at hudson.remoting.Request$2.run(Request.java:326)
	at hudson.remoting.InterceptingExecutorService$1.call(InterceptingExecutorService.java:72)
	at java.util.concurrent.FutureTask$Sync.innerRun(FutureTask.java:303)
	at java.util.concurrent.FutureTask.run(FutureTask.java:138)
	at java.util.concurrent.ThreadPoolExecutor$Worker.runTask(ThreadPoolExecutor.java:886)
	at java.util.concurrent.ThreadPoolExecutor$Worker.run(ThreadPoolExecutor.java:908)
	at java.lang.Thread.run(Thread.java:662)
Caused by: org.apache.maven.plugin.CompilationFailureException: Compilation failure
Failure executing javac, but could not parse the error:
javac: invalid target release: 1.7
Usage: javac <options> <source files>
use -help for a list of possible options


	at org.apache.maven.plugin.AbstractCompilerMojo.execute(AbstractCompilerMojo.java:678)
	at org.apache.maven.plugin.CompilerMojo.execute(CompilerMojo.java:128)
	at org.apache.maven.plugin.DefaultBuildPluginManager.executeMojo(DefaultBuildPluginManager.java:101)
	at org.apache.maven.lifecycle.internal.MojoExecutor.execute(MojoExecutor.java:209)
	... 27 more
channel stopped
Sending e-mails to: dev@davidsoergel.com
Finished: FAILURE