FailedConsole Output

Started by user soergel
Building remotely on i-3ac56242 in workspace /media/ephemeral0/workspace/dsutils
[dsutils] $ hg showconfig paths.default
[dsutils] $ hg pull --rev default
[dsutils] $ hg update --clean --rev default
0 files updated, 0 files merged, 0 files removed, 0 files unresolved
[dsutils] $ hg --config extensions.purge= clean --all
[dsutils] $ hg log --rev . --template {node}
[dsutils] $ hg log --rev . --template {rev}
[dsutils] $ hg log --rev 79540cb8a151828ad76e22772561fddb1623c52f
[dsutils] $ hg log --template "<changeset node='{node}' author='{author|xmlescape}' rev='{rev}' date='{date}'><msg>{desc|xmlescape}</msg><added>{file_adds|stringify|xmlescape}</added><deleted>{file_dels|stringify|xmlescape}</deleted><files>{files|stringify|xmlescape}</files><parents>{parents}</parents></changeset>\n" --rev default:0 --follow --prune 79540cb8a151828ad76e22772561fddb1623c52f
Parsing POMs
[dsutils] $ /usr/java/default/bin/java -Xmx1024M -XX:MaxPermSize=256M -cp /media/ephemeral0/maven3-agent.jar:/media/ephemeral0/tools/Maven/Maven_3.0.4/boot/plexus-classworlds-2.4.jar org.jvnet.hudson.maven3.agent.Maven3Main /media/ephemeral0/tools/Maven/Maven_3.0.4 /tmp/slave.jar /media/ephemeral0/maven3-interceptor.jar 33735
<===[JENKINS REMOTING CAPACITY]===>channel started
log4j:WARN No appenders could be found for logger (org.apache.commons.beanutils.converters.BooleanConverter).
log4j:WARN Please initialize the log4j system properly.
Executing Maven:  -B -f /media/ephemeral0/workspace/dsutils/pom.xml -DdevelopmentVersion=1.06-SNAPSHOT -DreleaseVersion=1.05 -U -cpu -e clean -Dresume=false release:prepare release:perform
[INFO] Error stacktraces are turned on.
[WARNING] Command line option -cpu is deprecated and will be removed in future Maven versions.
[INFO] Scanning for projects...
Projects to build: [MavenProject: com.davidsoergel:dsutils:1.04-SNAPSHOT @ /media/ephemeral0/workspace/dsutils/pom.xml]
projectStarted com.davidsoergel:dsutils:1.04-SNAPSHOT
[INFO]                                                                         
[INFO] ------------------------------------------------------------------------
[INFO] Building dsutils 1.04-SNAPSHOT
[INFO] ------------------------------------------------------------------------
mojoStarted org.apache.maven.plugins:maven-clean-plugin:2.4.1(default-clean)
[INFO] 
[INFO] --- maven-clean-plugin:2.4.1:clean (default-clean) @ dsutils ---
mojoSucceeded org.apache.maven.plugins:maven-clean-plugin:2.4.1(default-clean)
mojoStarted org.codehaus.mojo:cobertura-maven-plugin:2.5.1(clean)
[INFO] 
[INFO] --- cobertura-maven-plugin:2.5.1:clean (clean) @ dsutils ---
mojoSucceeded org.codehaus.mojo:cobertura-maven-plugin:2.5.1(clean)
projectSucceeded com.davidsoergel:dsutils:1.04-SNAPSHOT
projectStarted com.davidsoergel:dsutils:1.04-SNAPSHOT
[INFO]                                                                         
[INFO] ------------------------------------------------------------------------
[INFO] Building dsutils 1.04-SNAPSHOT
[INFO] ------------------------------------------------------------------------
mojoStarted org.apache.maven.plugins:maven-release-plugin:2.0(default-cli)
[INFO] 
[INFO] --- maven-release-plugin:2.0:prepare (default-cli) @ dsutils ---
[INFO] Verifying that there are no local modifications...
[INFO] EXECUTING: /bin/sh -c cd /media/ephemeral0/workspace/dsutils && hg status
[INFO] [release.properties:unknown]
[INFO] Checking dependencies and plugins for snapshots ...
[INFO] Transforming 'dsutils'...
[INFO] Not generating release POMs
[INFO] Executing goals 'clean verify'...
[INFO] [INFO] Scanning for projects...
[INFO] [INFO]                                                                         
[INFO] [INFO] ------------------------------------------------------------------------
[INFO] [INFO] Building dsutils 1.05
[INFO] [INFO] ------------------------------------------------------------------------
[INFO] [INFO] 
[INFO] [INFO] --- maven-clean-plugin:2.4.1:clean (default-clean) @ dsutils ---
[INFO] [INFO] 
[INFO] [INFO] --- cobertura-maven-plugin:2.5.1:clean (clean) @ dsutils ---
[INFO] [INFO] 
[INFO] [INFO] --- maven-resources-plugin:2.5:resources (default-resources) @ dsutils ---
[INFO] [debug] execute contextualize
[INFO] [INFO] Using 'UTF-8' encoding to copy filtered resources.
[INFO] [INFO] skip non existing resourceDirectory /media/ephemeral0/workspace/dsutils/src/main/resources
[INFO] [INFO] 
[INFO] [INFO] --- maven-compiler-plugin:2.4:compile (default-compile) @ dsutils ---
[INFO] [INFO] Compiling 152 source files to /media/ephemeral0/workspace/dsutils/target/classes
[INFO] [INFO] 
[INFO] [INFO] --- maven-resources-plugin:2.5:testResources (default-testResources) @ dsutils ---
[INFO] [debug] execute contextualize
[INFO] [INFO] Using 'UTF-8' encoding to copy filtered resources.
[INFO] [INFO] Copying 1 resource
[INFO] [INFO] 
[INFO] [INFO] --- maven-compiler-plugin:2.4:testCompile (default-testCompile) @ dsutils ---
[INFO] [INFO] Compiling 38 source files to /media/ephemeral0/workspace/dsutils/target/test-classes
[INFO] [INFO] 
[INFO] [INFO] --- maven-surefire-plugin:2.12:test (default-test) @ dsutils ---
[INFO] [INFO] Surefire report directory: /media/ephemeral0/workspace/dsutils/target/surefire-reports
[INFO] 
[INFO] -------------------------------------------------------
[INFO]  T E S T S
[INFO] -------------------------------------------------------
[INFO] Running TestSuite
[INFO] Tests run: 83, Failures: 0, Errors: 0, Skipped: 0, Time elapsed: 7.981 sec
[INFO] 
[INFO] Results :
[INFO] 
[INFO] Tests run: 83, Failures: 0, Errors: 0, Skipped: 0
[INFO] 
[INFO] [INFO] 
[INFO] [INFO] --- maven-jar-plugin:2.4:jar (default-jar) @ dsutils ---
[INFO] [INFO] Building jar: /media/ephemeral0/workspace/dsutils/target/dsutils-1.05.jar
[INFO] [INFO] 
[INFO] [INFO] --- maven-jar-plugin:2.4:test-jar (default) @ dsutils ---
[INFO] [INFO] Building jar: /media/ephemeral0/workspace/dsutils/target/dsutils-1.05-tests.jar
[INFO] [INFO] 
[INFO] [INFO] --- maven-jar-plugin:2.4:jar (default) @ dsutils ---
[INFO] [INFO] ------------------------------------------------------------------------
[INFO] [INFO] BUILD SUCCESS
[INFO] [INFO] ------------------------------------------------------------------------
[INFO] [INFO] Total time: 1:08.413s
[INFO] [INFO] Finished at: Fri Jul 06 20:12:28 UTC 2012
[INFO] [INFO] Final Memory: 14M/40M
[INFO] [INFO] ------------------------------------------------------------------------
[INFO] Checking in modified POMs...
[INFO] EXECUTING: /bin/sh -c cd /media/ephemeral0/workspace/dsutils && hg commit --message '[maven-release-plugin] prepare release dsutils-1.05' /media/ephemeral0/workspace/dsutils/pom.xml
[INFO] EXECUTING: /bin/sh -c cd /media/ephemeral0/workspace/dsutils && hg push ssh://dev.davidsoergel.com//home/hg/dsutils
[INFO] Tagging release with the label dsutils-1.05...
[INFO] EXECUTING: /bin/sh -c cd /media/ephemeral0/workspace/dsutils && hg tag --message '[maven-release-plugin]  copy for tag dsutils-1.05' dsutils-1.05
[ERROR] 
EXECUTION FAILED
  Execution of cmd : tag failed with exit code: 255.
  Working directory was: 
    /media/ephemeral0/workspace/dsutils
  Your Hg installation seems to be valid and complete.
    Hg version: 2.2.3 (OK)


mojoFailed org.apache.maven.plugins:maven-release-plugin:2.0(default-cli)
projectFailed com.davidsoergel:dsutils:1.04-SNAPSHOT
sessionEnded
[INFO] ------------------------------------------------------------------------
[INFO] BUILD FAILURE
[INFO] ------------------------------------------------------------------------
[INFO] Total time: 1:43.984s
[INFO] Finished at: Fri Jul 06 20:12:30 UTC 2012
[INFO] Final Memory: 12M/28M
[INFO] ------------------------------------------------------------------------
Projects to build: [MavenProject: com.davidsoergel:dsutils:1.04-SNAPSHOT @ /media/ephemeral0/workspace/dsutils/pom.xml]
[JENKINS] Archiving /media/ephemeral0/workspace/dsutils/pom.xml to /usr/share/apache-tomcat-7.0.22/.jenkins/jobs/dsutils/modules/com.davidsoergel$dsutils/builds/2012-07-06_16-10-31/archive/com.davidsoergel/dsutils/1.04-SNAPSHOT/dsutils-1.04-SNAPSHOT.pom
Waiting for Jenkins to finish collecting data
mavenExecutionResult exceptions not empty
message : Failed to execute goal org.apache.maven.plugins:maven-release-plugin:2.0:prepare (default-cli) on project dsutils: An error is occurred in the tag process: Exception while executing SCM command.
cause : An error is occurred in the tag process: Exception while executing SCM command.
Stack trace : 
org.apache.maven.lifecycle.LifecycleExecutionException: Failed to execute goal org.apache.maven.plugins:maven-release-plugin:2.0:prepare (default-cli) on project dsutils: An error is occurred in the tag process: Exception while executing SCM command.
	at org.apache.maven.lifecycle.internal.MojoExecutor.execute(MojoExecutor.java:217)
	at org.apache.maven.lifecycle.internal.MojoExecutor.execute(MojoExecutor.java:153)
	at org.apache.maven.lifecycle.internal.MojoExecutor.execute(MojoExecutor.java:145)
	at org.apache.maven.lifecycle.internal.LifecycleModuleBuilder.buildProject(LifecycleModuleBuilder.java:84)
	at org.apache.maven.lifecycle.internal.LifecycleModuleBuilder.buildProject(LifecycleModuleBuilder.java:59)
	at org.apache.maven.lifecycle.internal.LifecycleStarter.singleThreadedBuild(LifecycleStarter.java:183)
	at org.apache.maven.lifecycle.internal.LifecycleStarter.execute(LifecycleStarter.java:161)
	at org.apache.maven.DefaultMaven.doExecute(DefaultMaven.java:320)
	at org.apache.maven.DefaultMaven.execute(DefaultMaven.java:156)
	at org.jvnet.hudson.maven3.launcher.Maven3Launcher.main(Maven3Launcher.java:79)
	at sun.reflect.NativeMethodAccessorImpl.invoke0(Native Method)
	at sun.reflect.NativeMethodAccessorImpl.invoke(NativeMethodAccessorImpl.java:57)
	at sun.reflect.DelegatingMethodAccessorImpl.invoke(DelegatingMethodAccessorImpl.java:43)
	at java.lang.reflect.Method.invoke(Method.java:601)
	at org.codehaus.plexus.classworlds.launcher.Launcher.launchStandard(Launcher.java:329)
	at org.codehaus.plexus.classworlds.launcher.Launcher.launch(Launcher.java:239)
	at org.jvnet.hudson.maven3.agent.Maven3Main.launch(Maven3Main.java:158)
	at hudson.maven.Maven3Builder.call(Maven3Builder.java:98)
	at hudson.maven.Maven3Builder.call(Maven3Builder.java:64)
	at hudson.remoting.UserRequest.perform(UserRequest.java:118)
	at hudson.remoting.UserRequest.perform(UserRequest.java:48)
	at hudson.remoting.Request$2.run(Request.java:326)
	at hudson.remoting.InterceptingExecutorService$1.call(InterceptingExecutorService.java:72)
	at java.util.concurrent.FutureTask$Sync.innerRun(FutureTask.java:334)
	at java.util.concurrent.FutureTask.run(FutureTask.java:166)
	at java.util.concurrent.ThreadPoolExecutor.runWorker(ThreadPoolExecutor.java:1110)
	at java.util.concurrent.ThreadPoolExecutor$Worker.run(ThreadPoolExecutor.java:603)
	at java.lang.Thread.run(Thread.java:722)
Caused by: org.apache.maven.plugin.MojoExecutionException: An error is occurred in the tag process: Exception while executing SCM command.
	at org.apache.maven.plugins.release.PrepareReleaseMojo.prepareRelease(PrepareReleaseMojo.java:215)
	at org.apache.maven.plugins.release.PrepareReleaseMojo.execute(PrepareReleaseMojo.java:181)
	at org.apache.maven.plugin.DefaultBuildPluginManager.executeMojo(DefaultBuildPluginManager.java:101)
	at org.apache.maven.lifecycle.internal.MojoExecutor.execute(MojoExecutor.java:209)
	... 27 more
Caused by: org.apache.maven.shared.release.ReleaseExecutionException: An error is occurred in the tag process: Exception while executing SCM command.
	at org.apache.maven.shared.release.phase.ScmTagPhase.execute(ScmTagPhase.java:113)
	at org.apache.maven.shared.release.DefaultReleaseManager.prepare(DefaultReleaseManager.java:203)
	at org.apache.maven.shared.release.DefaultReleaseManager.prepare(DefaultReleaseManager.java:140)
	at org.apache.maven.shared.release.DefaultReleaseManager.prepare(DefaultReleaseManager.java:103)
	at org.apache.maven.plugins.release.PrepareReleaseMojo.prepareRelease(PrepareReleaseMojo.java:211)
	... 30 more
Caused by: org.apache.maven.scm.ScmException: Exception while executing SCM command.
	at org.apache.maven.scm.command.AbstractCommand.execute(AbstractCommand.java:63)
	at org.apache.maven.scm.provider.hg.HgScmProvider.tag(HgScmProvider.java:239)
	at org.apache.maven.scm.provider.AbstractScmProvider.tag(AbstractScmProvider.java:706)
	at org.apache.maven.shared.release.phase.ScmTagPhase.execute(ScmTagPhase.java:109)
	... 34 more
Caused by: org.apache.maven.scm.ScmException: Error while executing command tag --message [maven-release-plugin]  copy for tag dsutils-1.05 dsutils-1.05
	at org.apache.maven.scm.provider.hg.command.tag.HgTagCommand.executeTagCommand(HgTagCommand.java:105)
	at org.apache.maven.scm.command.tag.AbstractTagCommand.executeCommand(AbstractTagCommand.java:81)
	at org.apache.maven.scm.command.AbstractCommand.execute(AbstractCommand.java:59)
	... 37 more
Sending e-mails to: dev@davidsoergel.com
channel stopped
Sending e-mails to: dev@davidsoergel.com
Finished: FAILURE